Discussion:
Trouble building an RCP product
(too old to reply)
Ken Keefe
2016-10-06 18:28:22 UTC
Permalink
I wrote a few days ago about trouble building features and that is working
now. I'm on to the next task of trying to get my RCP product constructed
from those features. It looks like Maven is saying it can't find the
product. I don't understand how Maven/Tycho can put the project name
defined by the artifactId in the pom to the product definition file (called
core.project) file. I kept waiting for somewhere in the tutorial or other
tutorials for a place to identify the product definition file, but it never
came.

Any help in debugging this problem would be greatly appreciated. Here is
the pom from the product project:

<project>
<modelVersion>4.0.0</modelVersion>
<parent>
<groupId>edu.illinois.mobius</groupId>
<artifactId>edu.illinois.mobius.releng</artifactId>
<version>1.0.0-SNAPSHOT</version>
</parent>

<groupId>edu.illinois.mobius</groupId>
<artifactId>edu.illinois.mobius.product.core</artifactId>
<packaging>eclipse-repository</packaging>
<version>1.0.0-SNAPSHOT</version>

<build>
<plugins>
<plugin>
<groupId>org.eclipse.tycho</groupId>
<artifactId>tycho-p2-repository-plugin</artifactId>
<version>${tycho.version}</version>
<configuration>
<includeAllDependencies>true</includeAllDependencies>
</configuration>
</plugin>
<plugin>
<groupId>org.eclipse.tycho</groupId>
<artifactId>tycho-p2-director-plugin</artifactId>
<version>${tycho.version}</version>
<executions>
<execution>
<id>materialize-products</id>
<goals>
<goal>materialize-products</goal>
</goals>
</execution>
<execution>
<id>archive-products</id>
<goals>
<goal>archive-products</goal>
</goals>
</execution>
</executions>
</plugin>
</plugins>
</build>
</project>

Here is the error output from maven:

[INFO] edu.illinois.mobius.product.core ................... FAILURE [
0.262 s]
[INFO]
------------------------------------------------------------------------
[INFO] BUILD FAILURE
[INFO]
------------------------------------------------------------------------
[INFO] Total time: 38.834 s
[INFO] Finished at: 2016-10-06T13:21:59-05:00
[INFO] Final Memory: 286M/1288M
[INFO]
------------------------------------------------------------------------
[ERROR] Failed to execute goal
org.eclipse.tycho:tycho-p2-repository-plugin:0.25.0:assemble-repository
(default-assemble-repository) on project edu.illinois.mobius.product.core:
Execution default-assemble-repository of goal
org.eclipse.tycho:tycho-p2-repository-plugin:0.25.0:assemble-repository
failed: Cannot resolve dependencies of MavenProject:
edu.illinois.mobius:edu.illinois.mobius.product.core:1.0.0-SNAPSHOT @
/Users/kjkeefe/git/Mobius-4.6/releng/edu.illinois.mobius.product.core/pom.xml:
See log for details -> [Help 1]
org.apache.maven.lifecycle.LifecycleExecutionException: Failed to execute
goal
org.eclipse.tycho:tycho-p2-repository-plugin:0.25.0:assemble-repository
(default-assemble-repository) on project edu.illinois.mobius.product.core:
Execution default-assemble-repository of goal
org.eclipse.tycho:tycho-p2-repository-plugin:0.25.0:assemble-repository
failed: Cannot resolve dependencies of MavenProject:
edu.illinois.mobius:edu.illinois.mobius.product.core:1.0.0-SNAPSHOT @
/Users/kjkeefe/git/Mobius-4.6/releng/edu.illinois.mobius.product.core/pom.xml
at
org.apache.maven.lifecycle.internal.MojoExecutor.execute(MojoExecutor.java:224)
at
org.apache.maven.lifecycle.internal.MojoExecutor.execute(MojoExecutor.java:153)
at
org.apache.maven.lifecycle.internal.MojoExecutor.execute(MojoExecutor.java:145)
at
org.apache.maven.lifecycle.internal.LifecycleModuleBuilder.buildProject(LifecycleModuleBuilder.java:116)
at
org.apache.maven.lifecycle.internal.LifecycleModuleBuilder.buildProject(LifecycleModuleBuilder.java:80)
at
org.apache.maven.lifecycle.internal.builder.singlethreaded.SingleThreadedBuilder.build(SingleThreadedBuilder.java:51)
at
org.apache.maven.lifecycle.internal.LifecycleStarter.execute(LifecycleStarter.java:128)
at org.apache.maven.DefaultMaven.doExecute(DefaultMaven.java:307)
at org.apache.maven.DefaultMaven.doExecute(DefaultMaven.java:193)
at org.apache.maven.DefaultMaven.execute(DefaultMaven.java:106)
at org.apache.maven.cli.MavenCli.execute(MavenCli.java:862)
at org.apache.maven.cli.MavenCli.doMain(MavenCli.java:286)
at org.apache.maven.cli.MavenCli.main(MavenCli.java:197)
at sun.reflect.NativeMethodAccessorImpl.invoke0(Native Method)
at
sun.reflect.NativeMethodAccessorImpl.invoke(NativeMethodAccessorImpl.java:62)
at
sun.reflect.DelegatingMethodAccessorImpl.invoke(DelegatingMethodAccessorImpl.java:43)
at java.lang.reflect.Method.invoke(Method.java:497)
at
org.codehaus.plexus.classworlds.launcher.Launcher.launchEnhanced(Launcher.java:289)
at
org.codehaus.plexus.classworlds.launcher.Launcher.launch(Launcher.java:229)
at
org.codehaus.plexus.classworlds.launcher.Launcher.mainWithExitCode(Launcher.java:415)
at org.codehaus.plexus.classworlds.launcher.Launcher.main(Launcher.java:356)
Caused by: org.apache.maven.plugin.PluginExecutionException: Execution
default-assemble-repository of goal
org.eclipse.tycho:tycho-p2-repository-plugin:0.25.0:assemble-repository
failed: Cannot resolve dependencies of MavenProject:
edu.illinois.mobius:edu.illinois.mobius.product.core:1.0.0-SNAPSHOT @
/Users/kjkeefe/git/Mobius-4.6/releng/edu.illinois.mobius.product.core/pom.xml
at
org.apache.maven.plugin.DefaultBuildPluginManager.executeMojo(DefaultBuildPluginManager.java:145)
at
org.apache.maven.lifecycle.internal.MojoExecutor.execute(MojoExecutor.java:208)
... 20 more
Caused by: org.eclipse.tycho.artifacts.DependencyResolutionException:
Cannot resolve dependencies of MavenProject:
edu.illinois.mobius:edu.illinois.mobius.product.core:1.0.0-SNAPSHOT @
/Users/kjkeefe/git/Mobius-4.6/releng/edu.illinois.mobius.product.core/pom.xml
at
org.eclipse.tycho.p2.resolver.P2ResolverImpl.resolveDependencies(P2ResolverImpl.java:202)
at
org.eclipse.tycho.p2.resolver.P2ResolverImpl.resolveDependencies(P2ResolverImpl.java:116)
at
org.eclipse.tycho.p2.resolver.P2DependencyResolver.doResolveDependencies(P2DependencyResolver.java:367)
at
org.eclipse.tycho.p2.resolver.P2DependencyResolver.resolveDependencies(P2DependencyResolver.java:335)
at
org.eclipse.tycho.p2.facade.RepositoryReferenceTool.addTargetPlatformRepository(RepositoryReferenceTool.java:124)
at
org.eclipse.tycho.p2.facade.RepositoryReferenceTool.getVisibleRepositories(RepositoryReferenceTool.java:96)
at
org.eclipse.tycho.plugins.p2.repository.AssembleRepositoryMojo.getVisibleRepositories(AssembleRepositoryMojo.java:165)
at
org.eclipse.tycho.plugins.p2.repository.AssembleRepositoryMojo.execute(AssembleRepositoryMojo.java:137)
at
org.apache.maven.plugin.DefaultBuildPluginManager.executeMojo(DefaultBuildPluginManager.java:134)
... 21 more
Caused by: org.eclipse.tycho.p2.util.resolution.ResolverException: See log
for details
at
org.eclipse.tycho.p2.util.resolution.ProjectorResolutionStrategy.resolve(ProjectorResolutionStrategy.java:88)
at
org.eclipse.tycho.p2.util.resolution.AbstractResolutionStrategy.resolve(AbstractResolutionStrategy.java:42)
at
org.eclipse.tycho.p2.resolver.P2ResolverImpl.resolveDependencies(P2ResolverImpl.java:195)
... 29 more
[ERROR]
[ERROR]
[ERROR] For more information about the errors and possible solutions,
please read the following articles:
[ERROR] [Help 1]
http://cwiki.apache.org/confluence/display/MAVEN/PluginExecutionException
[ERROR]
[ERROR] After correcting the problems, you can resume the build with the
command
[ERROR] mvn <goals> -rf :edu.illinois.mobius.product.core
Paul Roubekas
2016-10-06 19:45:54 UTC
Permalink
Here is mine that has been working for months.


<project xmlns="http://maven.apache.org/POM/4.0.0"
xmlns:xsi="http://www.w3.org/2001/XMLSchema-instance"
xsi:schemaLocation="http://maven.apache.org/POM/4.0.0
http://maven.apache.org/xsd/maven-4.0.0.xsd">
<modelVersion>4.0.0</modelVersion>
<name>MyProduct - application product</name>
<artifactId>com.myProduct.app.product</artifactId>
<packaging>eclipse-repository</packaging>
<parent>
<groupId>com.myProduct</groupId>
<artifactId>com.myProduct.releng.parent</artifactId>
<version>0.1.0-SNAPSHOT</version>

<relativePath>../../releng/com.myProduct.releng.parent/pom.xml</relativePath>
</parent>

<build>
<plugins>
<plugin>
<groupId>org.eclipse.tycho</groupId>
<artifactId>tycho-p2-director-plugin</artifactId>
<version>${tycho-version}</version>
<executions>
<execution>
<id>materialize-products</id>
<goals>
<goal>materialize-products</goal>
</goals>
</execution>
<execution>
<id>archive-products</id>
<goals>
<goal>archive-products</goal>
</goals>
</execution>
</executions>
</plugin>
</plugins>
</build
Post by Ken Keefe
I wrote a few days ago about trouble building features and that is
working now. I'm on to the next task of trying to get my RCP product
constructed from those features. It looks like Maven is saying it
can't find the product. I don't understand how Maven/Tycho can put the
project name defined by the artifactId in the pom to the product
definition file (called core.project) file. I kept waiting for
somewhere in the tutorial or other tutorials for a place to identify
the product definition file, but it never came.
Any help in debugging this problem would be greatly appreciated. Here
<project>
<modelVersion>4.0.0</modelVersion>
<parent>
<groupId>edu.illinois.mobius</groupId>
<artifactId>edu.illinois.mobius.releng</artifactId>
<version>1.0.0-SNAPSHOT</version>
</parent>
<groupId>edu.illinois.mobius</groupId>
<artifactId>edu.illinois.mobius.product.core</artifactId>
<packaging>eclipse-repository</packaging>
<version>1.0.0-SNAPSHOT</version>
<build>
<plugins>
<plugin>
<groupId>org.eclipse.tycho</groupId>
<artifactId>tycho-p2-repository-plugin</artifactId>
<version>${tycho.version}</version>
<configuration>
<includeAllDependencies>true</includeAllDependencies>
</configuration>
</plugin>
<plugin>
<groupId>org.eclipse.tycho</groupId>
<artifactId>tycho-p2-director-plugin</artifactId>
<version>${tycho.version}</version>
<executions>
<execution>
<id>materialize-products</id>
<goals>
<goal>materialize-products</goal>
</goals>
</execution>
<execution>
<id>archive-products</id>
<goals>
<goal>archive-products</goal>
</goals>
</execution>
</executions>
</plugin>
</plugins>
</build>
</project>
[INFO] edu.illinois.mobius.product.core ................... FAILURE [
0.262 s]
[INFO]
------------------------------------------------------------------------
[INFO] BUILD FAILURE
[INFO]
------------------------------------------------------------------------
[INFO] Total time: 38.834 s
[INFO] Finished at: 2016-10-06T13:21:59-05:00
[INFO] Final Memory: 286M/1288M
[INFO]
------------------------------------------------------------------------
[ERROR] Failed to execute goal
org.eclipse.tycho:tycho-p2-repository-plugin:0.25.0:assemble-repository
(default-assemble-repository) on project
edu.illinois.mobius.product.core: Execution
default-assemble-repository of goal
org.eclipse.tycho:tycho-p2-repository-plugin:0.25.0:assemble-repository
See log for details -> [Help 1]
org.apache.maven.lifecycle.LifecycleExecutionException: Failed to
execute goal
org.eclipse.tycho:tycho-p2-repository-plugin:0.25.0:assemble-repository
(default-assemble-repository) on project
edu.illinois.mobius.product.core: Execution
default-assemble-repository of goal
org.eclipse.tycho:tycho-p2-repository-plugin:0.25.0:assemble-repository
/Users/kjkeefe/git/Mobius-4.6/releng/edu.illinois.mobius.product.core/pom.xml
at
org.apache.maven.lifecycle.internal.MojoExecutor.execute(MojoExecutor.java:224)
at
org.apache.maven.lifecycle.internal.MojoExecutor.execute(MojoExecutor.java:153)
at
org.apache.maven.lifecycle.internal.MojoExecutor.execute(MojoExecutor.java:145)
at
org.apache.maven.lifecycle.internal.LifecycleModuleBuilder.buildProject(LifecycleModuleBuilder.java:116)
at
org.apache.maven.lifecycle.internal.LifecycleModuleBuilder.buildProject(LifecycleModuleBuilder.java:80)
at
org.apache.maven.lifecycle.internal.builder.singlethreaded.SingleThreadedBuilder.build(SingleThreadedBuilder.java:51)
at
org.apache.maven.lifecycle.internal.LifecycleStarter.execute(LifecycleStarter.java:128)
at org.apache.maven.DefaultMaven.doExecute(DefaultMaven.java:307)
at org.apache.maven.DefaultMaven.doExecute(DefaultMaven.java:193)
at org.apache.maven.DefaultMaven.execute(DefaultMaven.java:106)
at org.apache.maven.cli.MavenCli.execute(MavenCli.java:862)
at org.apache.maven.cli.MavenCli.doMain(MavenCli.java:286)
at org.apache.maven.cli.MavenCli.main(MavenCli.java:197)
at sun.reflect.NativeMethodAccessorImpl.invoke0(Native Method)
at
sun.reflect.NativeMethodAccessorImpl.invoke(NativeMethodAccessorImpl.java:62)
at
sun.reflect.DelegatingMethodAccessorImpl.invoke(DelegatingMethodAccessorImpl.java:43)
at java.lang.reflect.Method.invoke(Method.java:497)
at
org.codehaus.plexus.classworlds.launcher.Launcher.launchEnhanced(Launcher.java:289)
at
org.codehaus.plexus.classworlds.launcher.Launcher.launch(Launcher.java:229)
at
org.codehaus.plexus.classworlds.launcher.Launcher.mainWithExitCode(Launcher.java:415)
at
org.codehaus.plexus.classworlds.launcher.Launcher.main(Launcher.java:356)
Caused by: org.apache.maven.plugin.PluginExecutionException: Execution
default-assemble-repository of goal
org.eclipse.tycho:tycho-p2-repository-plugin:0.25.0:assemble-repository
/Users/kjkeefe/git/Mobius-4.6/releng/edu.illinois.mobius.product.core/pom.xml
at
org.apache.maven.plugin.DefaultBuildPluginManager.executeMojo(DefaultBuildPluginManager.java:145)
at
org.apache.maven.lifecycle.internal.MojoExecutor.execute(MojoExecutor.java:208)
... 20 more
/Users/kjkeefe/git/Mobius-4.6/releng/edu.illinois.mobius.product.core/pom.xml
at
org.eclipse.tycho.p2.resolver.P2ResolverImpl.resolveDependencies(P2ResolverImpl.java:202)
at
org.eclipse.tycho.p2.resolver.P2ResolverImpl.resolveDependencies(P2ResolverImpl.java:116)
at
org.eclipse.tycho.p2.resolver.P2DependencyResolver.doResolveDependencies(P2DependencyResolver.java:367)
at
org.eclipse.tycho.p2.resolver.P2DependencyResolver.resolveDependencies(P2DependencyResolver.java:335)
at
org.eclipse.tycho.p2.facade.RepositoryReferenceTool.addTargetPlatformRepository(RepositoryReferenceTool.java:124)
at
org.eclipse.tycho.p2.facade.RepositoryReferenceTool.getVisibleRepositories(RepositoryReferenceTool.java:96)
at
org.eclipse.tycho.plugins.p2.repository.AssembleRepositoryMojo.getVisibleRepositories(AssembleRepositoryMojo.java:165)
at
org.eclipse.tycho.plugins.p2.repository.AssembleRepositoryMojo.execute(AssembleRepositoryMojo.java:137)
at
org.apache.maven.plugin.DefaultBuildPluginManager.executeMojo(DefaultBuildPluginManager.java:134)
... 21 more
Caused by: org.eclipse.tycho.p2.util.resolution.ResolverException: See
log for details
at
org.eclipse.tycho.p2.util.resolution.ProjectorResolutionStrategy.resolve(ProjectorResolutionStrategy.java:88)
at
org.eclipse.tycho.p2.util.resolution.AbstractResolutionStrategy.resolve(AbstractResolutionStrategy.java:42)
at
org.eclipse.tycho.p2.resolver.P2ResolverImpl.resolveDependencies(P2ResolverImpl.java:195)
... 29 more
[ERROR]
[ERROR]
[ERROR] For more information about the errors and possible solutions,
[ERROR] [Help 1]
http://cwiki.apache.org/confluence/display/MAVEN/PluginExecutionException
[ERROR]
[ERROR] After correcting the problems, you can resume the build with
the command
[ERROR] mvn <goals> -rf :edu.illinois.mobius.product.core
_______________________________________________
tycho-user mailing list
To change your delivery options, retrieve your password, or unsubscribe from this list, visit
https://dev.eclipse.org/mailman/listinfo/tycho-user
--
The people that bring you Usque <http://Usque.software/>.
Ken Keefe
2016-10-06 20:34:37 UTC
Permalink
I switched to trying update site part of the vogella tutorial:
http://www.vogella.com/tutorials/EclipseTycho/article.html#run-the-build

I get the same sort of error saying it cannot resolve the dependencies. I
decided to change the category.xml file around to see if I could narrow
down the problem. I ended up removing all of my features and adding one of
the features in the build target (I randomly picked org.eclipse.cvs). This
builds correctly and I can see the new p2 repository with the cvs feature
and its plugins looking all correct.

When I remove that cvs feature and add just one of my features, it goes
back to the same error. Is there something I need to do to tell Maven where
to find my features? They are built just prior to it trying to create the
update site. I'm using the directory structure that vogella suggests, so my
recently constructed feature lives in
features/edu.illinois.mobius.feature/target/ .

To initiate the maven build, I am using "mvn clean verify".

Thoughts?

Ken

[ERROR] Failed to execute goal
org.eclipse.tycho:tycho-p2-repository-plugin:0.25.0:assemble-repository
(default-assemble-repository) on project edu.illinois.mobius.update:
Execution default-assemble-repository of goal
org.eclipse.tycho:tycho-p2-repository-plugin:0.25.0:assemble-repository
failed: Cannot resolve dependencies of MavenProject:
edu.illinois.mobius:edu.illinois.mobius.update:2.6.0-SNAPSHOT @
/Users/kjkeefe/git/Mobius-4.6/releng/edu.illinois.mobius.update/pom.xml:
See log for details -> [Help 1]
[ERROR]
[ERROR] To see the full stack trace of the errors, re-run Maven with the -e
switch.
[ERROR] Re-run Maven using the -X switch to enable full debug logging.
[ERROR]
[ERROR] For more information about the errors and possible solutions,
please read the following articles:
[ERROR] [Help 1]
http://cwiki.apache.org/confluence/display/MAVEN/PluginExecutionException
[ERROR]
[ERROR] After correcting the problems, you can resume the build with the
command
[ERROR] mvn <goals> -rf :edu.illinois.mobius.update
Post by Paul Roubekas
Here is mine that has been working for months.
<project xmlns="http://maven.apache.org/POM/4.0.0"
<https://urldefense.proofpoint.com/v2/url?u=http-3A__maven.apache.org_POM_4.0.0&d=DQMF-g&c=8hUWFZcy2Z-Za5rBPlktOQ&r=cGMglYXcPR0IoSyYQ4AQ6bvD725xIPobF9W5B8eSXuA&m=sis435jfM7eIL7PsaunYcYuy437-8rSUbzt9GAWwPSg&s=WwDOMXWIK-IYohDaP3089uFxsfnXWi7hhPh1rmJ62Ow&e=>
xmlns:xsi="http://www.w3.org/2001/XMLSchema-instance"
<https://urldefense.proofpoint.com/v2/url?u=http-3A__www.w3.org_2001_XMLSchema-2Dinstance&d=DQMF-g&c=8hUWFZcy2Z-Za5rBPlktOQ&r=cGMglYXcPR0IoSyYQ4AQ6bvD725xIPobF9W5B8eSXuA&m=sis435jfM7eIL7PsaunYcYuy437-8rSUbzt9GAWwPSg&s=XaWYV69YMr4riOBOXDjFSEFzayYgSalXvSA29hXhIMk&e=>
xsi:schemaLocation="http://maven.apache.org/POM/4.0.0
http://maven.apache.org/xsd/maven-4.0.0.xsd"
<https://urldefense.proofpoint.com/v2/url?u=http-3A__maven.apache.org_POM_4.0.0http-3A__maven.apache.org_xsd_maven-2D4.0.0.xsd&d=DQMF-g&c=8hUWFZcy2Z-Za5rBPlktOQ&r=cGMglYXcPR0IoSyYQ4AQ6bvD725xIPobF9W5B8eSXuA&m=sis435jfM7eIL7PsaunYcYuy437-8rSUbzt9GAWwPSg&s=PBaeHLYuyz9tT_Z2iPtAd6f423nUNCHXHGj0RUKJkTY&e=>
<modelVersion>4.0.0</modelVersion>
<name>MyProduct - application product</name>
<artifactId>com.myProduct.app.product</artifactId>
<packaging>eclipse-repository</packaging>
<parent>
<groupId>com.myProduct</groupId>
<artifactId>com.myProduct.releng.parent</artifactId>
<version>0.1.0-SNAPSHOT</version>
<relativePath>../../releng/com.myProduct.releng.parent/
pom.xml</relativePath>
</parent>
<build>
<plugins>
<plugin>
<groupId>org.eclipse.tycho</groupId>
<artifactId>tycho-p2-director-plugin</artifactId>
<version>${tycho-version}</version>
<executions>
<execution>
<id>materialize-products</id>
<goals>
<goal>materialize-products</goal>
</goals>
</execution>
<execution>
<id>archive-products</id>
<goals>
<goal>archive-products</goal>
</goals>
</execution>
</executions>
</plugin>
</plugins>
</build
I wrote a few days ago about trouble building features and that is working
now. I'm on to the next task of trying to get my RCP product constructed
from those features. It looks like Maven is saying it can't find the
product. I don't understand how Maven/Tycho can put the project name
defined by the artifactId in the pom to the product definition file (called
core.project) file. I kept waiting for somewhere in the tutorial or other
tutorials for a place to identify the product definition file, but it never
came.
Any help in debugging this problem would be greatly appreciated. Here is
<project>
<modelVersion>4.0.0</modelVersion>
<parent>
<groupId>edu.illinois.mobius</groupId>
<artifactId>edu.illinois.mobius.releng</artifactId>
<version>1.0.0-SNAPSHOT</version>
</parent>
<groupId>edu.illinois.mobius</groupId>
<artifactId>edu.illinois.mobius.product.core</artifactId>
<packaging>eclipse-repository</packaging>
<version>1.0.0-SNAPSHOT</version>
<build>
<plugins>
<plugin>
<groupId>org.eclipse.tycho</groupId>
<artifactId>tycho-p2-repository-plugin</artifactId>
<version>${tycho.version}</version>
<configuration>
<includeAllDependencies>true</includeAllDependencies>
</configuration>
</plugin>
<plugin>
<groupId>org.eclipse.tycho</groupId>
<artifactId>tycho-p2-director-plugin</artifactId>
<version>${tycho.version}</version>
<executions>
<execution>
<id>materialize-products</id>
<goals>
<goal>materialize-products</goal>
</goals>
</execution>
<execution>
<id>archive-products</id>
<goals>
<goal>archive-products</goal>
</goals>
</execution>
</executions>
</plugin>
</plugins>
</build>
</project>
[INFO] edu.illinois.mobius.product.core ................... FAILURE [
0.262 s]
[INFO] ------------------------------------------------------------
------------
[INFO] BUILD FAILURE
[INFO] ------------------------------------------------------------
------------
[INFO] Total time: 38.834 s
[INFO] Finished at: 2016-10-06T13:21:59-05:00
[INFO] Final Memory: 286M/1288M
[INFO] ------------------------------------------------------------
------------
[ERROR] Failed to execute goal org.eclipse.tycho:tycho-p2-
repository-plugin:0.25.0:assemble-repository
Execution default-assemble-repository of goal org.eclipse.tycho:tycho-p2-
repository-plugin:0.25.0:assemble-repository failed: Cannot resolve
dependencies of MavenProject: edu.illinois.mobius:edu.
See log for details -> [Help 1]
org.apache.maven.lifecycle.LifecycleExecutionException: Failed to execute
goal org.eclipse.tycho:tycho-p2-repository-plugin:0.25.0:assemble-repository
Execution default-assemble-repository of goal org.eclipse.tycho:tycho-p2-
repository-plugin:0.25.0:assemble-repository failed: Cannot resolve
dependencies of MavenProject: edu.illinois.mobius:edu.
/Users/kjkeefe/git/Mobius-4.6/releng/edu.illinois.mobius.
product.core/pom.xml
at org.apache.maven.lifecycle.internal.MojoExecutor.execute(
MojoExecutor.java:224)
at org.apache.maven.lifecycle.internal.MojoExecutor.execute(
MojoExecutor.java:153)
at org.apache.maven.lifecycle.internal.MojoExecutor.execute(
MojoExecutor.java:145)
at org.apache.maven.lifecycle.internal.LifecycleModuleBuilder.
buildProject(LifecycleModuleBuilder.java:116)
at org.apache.maven.lifecycle.internal.LifecycleModuleBuilder.
buildProject(LifecycleModuleBuilder.java:80)
at org.apache.maven.lifecycle.internal.builder.singlethreaded.
SingleThreadedBuilder.build(SingleThreadedBuilder.java:51)
at org.apache.maven.lifecycle.internal.LifecycleStarter.
execute(LifecycleStarter.java:128)
at org.apache.maven.DefaultMaven.doExecute(DefaultMaven.java:307)
at org.apache.maven.DefaultMaven.doExecute(DefaultMaven.java:193)
at org.apache.maven.DefaultMaven.execute(DefaultMaven.java:106)
at org.apache.maven.cli.MavenCli.execute(MavenCli.java:862)
at org.apache.maven.cli.MavenCli.doMain(MavenCli.java:286)
at org.apache.maven.cli.MavenCli.main(MavenCli.java:197)
at sun.reflect.NativeMethodAccessorImpl.invoke0(Native Method)
at sun.reflect.NativeMethodAccessorImpl.invoke(
NativeMethodAccessorImpl.java:62)
at sun.reflect.DelegatingMethodAccessorImpl.invoke(
DelegatingMethodAccessorImpl.java:43)
at java.lang.reflect.Method.invoke(Method.java:497)
at org.codehaus.plexus.classworlds.launcher.Launcher.
launchEnhanced(Launcher.java:289)
at org.codehaus.plexus.classworlds.launcher.Launcher.
launch(Launcher.java:229)
at org.codehaus.plexus.classworlds.launcher.Launcher.
mainWithExitCode(Launcher.java:415)
at org.codehaus.plexus.classworlds.launcher.Launcher.
main(Launcher.java:356)
Caused by: org.apache.maven.plugin.PluginExecutionException: Execution
default-assemble-repository of goal org.eclipse.tycho:tycho-p2-
repository-plugin:0.25.0:assemble-repository failed: Cannot resolve
dependencies of MavenProject: edu.illinois.mobius:edu.
/Users/kjkeefe/git/Mobius-4.6/releng/edu.illinois.mobius.
product.core/pom.xml
at org.apache.maven.plugin.DefaultBuildPluginManager.executeMojo(
DefaultBuildPluginManager.java:145)
at org.apache.maven.lifecycle.internal.MojoExecutor.execute(
MojoExecutor.java:208)
... 20 more
Cannot resolve dependencies of MavenProject: edu.illinois.mobius:edu.
/Users/kjkeefe/git/Mobius-4.6/releng/edu.illinois.mobius.
product.core/pom.xml
at org.eclipse.tycho.p2.resolver.P2ResolverImpl.resolveDependencies(
P2ResolverImpl.java:202)
at org.eclipse.tycho.p2.resolver.P2ResolverImpl.resolveDependencies(
P2ResolverImpl.java:116)
at org.eclipse.tycho.p2.resolver.P2DependencyResolver.
doResolveDependencies(P2DependencyResolver.java:367)
at org.eclipse.tycho.p2.resolver.P2DependencyResolver.resolveDependencies(
P2DependencyResolver.java:335)
at org.eclipse.tycho.p2.facade.RepositoryReferenceTool.
addTargetPlatformRepository(RepositoryReferenceTool.java:124)
at org.eclipse.tycho.p2.facade.RepositoryReferenceTool.
getVisibleRepositories(RepositoryReferenceTool.java:96)
at org.eclipse.tycho.plugins.p2.repository.AssembleRepositoryMojo.
getVisibleRepositories(AssembleRepositoryMojo.java:165)
at org.eclipse.tycho.plugins.p2.repository.AssembleRepositoryMojo.execute(
AssembleRepositoryMojo.java:137)
at org.apache.maven.plugin.DefaultBuildPluginManager.executeMojo(
DefaultBuildPluginManager.java:134)
... 21 more
Caused by: org.eclipse.tycho.p2.util.resolution.ResolverException: See
log for details
at org.eclipse.tycho.p2.util.resolution.ProjectorResolutionStrategy.
resolve(ProjectorResolutionStrategy.java:88)
at org.eclipse.tycho.p2.util.resolution.AbstractResolutionStrategy.
resolve(AbstractResolutionStrategy.java:42)
at org.eclipse.tycho.p2.resolver.P2ResolverImpl.resolveDependencies(
P2ResolverImpl.java:195)
... 29 more
[ERROR]
[ERROR]
[ERROR] For more information about the errors and possible solutions,
[ERROR] [Help 1] http://cwiki.apache.org/confluence/display/MAVEN/
PluginExecutionException
<https://urldefense.proofpoint.com/v2/url?u=http-3A__cwiki.apache.org_confluence_display_MAVEN_PluginExecutionException&d=DQMF-g&c=8hUWFZcy2Z-Za5rBPlktOQ&r=cGMglYXcPR0IoSyYQ4AQ6bvD725xIPobF9W5B8eSXuA&m=sis435jfM7eIL7PsaunYcYuy437-8rSUbzt9GAWwPSg&s=EH1aDCtIwr0eRU6dwj6VWOuwp4BpShrOe8aRJd79XHw&e=>
[ERROR]
[ERROR] After correcting the problems, you can resume the build with the
command
[ERROR] mvn <goals> -rf :edu.illinois.mobius.product.core
_______________________________________________
To change your delivery options, retrieve your password, or unsubscribe from this list, visithttps://dev.eclipse.org/mailman/listinfo/tycho-user <https://urldefense.proofpoint.com/v2/url?u=https-3A__dev.eclipse.org_mailman_listinfo_tycho-2Duser&d=DQMF-g&c=8hUWFZcy2Z-Za5rBPlktOQ&r=cGMglYXcPR0IoSyYQ4AQ6bvD725xIPobF9W5B8eSXuA&m=sis435jfM7eIL7PsaunYcYuy437-8rSUbzt9GAWwPSg&s=GBw94hWU4AeGz-yzWQmF9V4c7-s_GFAOtgzpOvtW8K8&e=>
--
The people that bring you Usque
<https://urldefense.proofpoint.com/v2/url?u=http-3A__Usque.software_&d=DQMF-g&c=8hUWFZcy2Z-Za5rBPlktOQ&r=cGMglYXcPR0IoSyYQ4AQ6bvD725xIPobF9W5B8eSXuA&m=sis435jfM7eIL7PsaunYcYuy437-8rSUbzt9GAWwPSg&s=DA0GFwDciDupaVdO4Wz43---Fm7JVKAUGTQE4v5NWUw&e=>
.
_______________________________________________
tycho-user mailing list
To change your delivery options, retrieve your password, or unsubscribe
from this list, visit
https://dev.eclipse.org/mailman/listinfo/tycho-user
Tom Bryan (tombry)
2016-10-06 21:08:12 UTC
Permalink
Did you try to do an install instead?
mvn clean install

---Tom

From: <tycho-user-***@eclipse.org<mailto:tycho-user-***@eclipse.org>> on behalf of Ken Keefe <***@illinois.edu<mailto:***@illinois.edu>>
Reply-To: Tycho user list <tycho-***@eclipse.org<mailto:tycho-***@eclipse.org>>
Date: Thursday, October 6, 2016 at 4:34 PM
To: Tycho user list <tycho-***@eclipse.org<mailto:tycho-***@eclipse.org>>
Subject: Re: [tycho-user] Trouble building an RCP product

I switched to trying update site part of the vogella tutorial: http://www.vogella.com/tutorials/EclipseTycho/article.html#run-the-build

I get the same sort of error saying it cannot resolve the dependencies. I decided to change the category.xml file around to see if I could narrow down the problem. I ended up removing all of my features and adding one of the features in the build target (I randomly picked org.eclipse.cvs). This builds correctly and I can see the new p2 repository with the cvs feature and its plugins looking all correct.

When I remove that cvs feature and add just one of my features, it goes back to the same error. Is there something I need to do to tell Maven where to find my features? They are built just prior to it trying to create the update site. I'm using the directory structure that vogella suggests, so my recently constructed feature lives in features/edu.illinois.mobius.feature/target/ .

To initiate the maven build, I am using "mvn clean verify".

Thoughts?

Ken

[ERROR] Failed to execute goal org.eclipse.tycho:tycho-p2-repository-plugin:0.25.0:assemble-repository (default-assemble-repository) on project edu.illinois.mobius.update: Execution default-assemble-repository of goal org.eclipse.tycho:tycho-p2-repository-plugin:0.25.0:assemble-repository failed: Cannot resolve dependencies of MavenProject: edu.illinois.mobius:edu.illinois.mobius.update:2.6.0-SNAPSHOT @ /Users/kjkeefe/git/Mobius-4.6/releng/edu.illinois.mobius.update/pom.xml: See log for details -> [Help 1]
[ERROR]
[ERROR] To see the full stack trace of the errors, re-run Maven with the -e switch.
[ERROR] Re-run Maven using the -X switch to enable full debug logging.
[ERROR]
[ERROR] For more information about the errors and possible solutions, please read the following articles:
[ERROR] [Help 1] http://cwiki.apache.org/confluence/display/MAVEN/PluginExecutionException
[ERROR]
[ERROR] After correcting the problems, you can resume the build with the command
[ERROR] mvn <goals> -rf :edu.illinois.mobius.update



On Thu, Oct 6, 2016 at 12:45 PM, Paul Roubekas <***@orthogroup.holdings<mailto:***@orthogroup.holdings>> wrote:
Here is mine that has been working for months.


<project xmlns="http://maven.apache.org/POM/4.0.0"<https://urldefense.proofpoint.com/v2/url?u=http-3A__maven.apache.org_POM_4.0.0&d=DQMF-g&c=8hUWFZcy2Z-Za5rBPlktOQ&r=cGMglYXcPR0IoSyYQ4AQ6bvD725xIPobF9W5B8eSXuA&m=sis435jfM7eIL7PsaunYcYuy437-8rSUbzt9GAWwPSg&s=WwDOMXWIK-IYohDaP3089uFxsfnXWi7hhPh1rmJ62Ow&e=> xmlns:xsi="http://www.w3.org/2001/XMLSchema-instance"<https://urldefense.proofpoint.com/v2/url?u=http-3A__www.w3.org_2001_XMLSchema-2Dinstance&d=DQMF-g&c=8hUWFZcy2Z-Za5rBPlktOQ&r=cGMglYXcPR0IoSyYQ4AQ6bvD725xIPobF9W5B8eSXuA&m=sis435jfM7eIL7PsaunYcYuy437-8rSUbzt9GAWwPSg&s=XaWYV69YMr4riOBOXDjFSEFzayYgSalXvSA29hXhIMk&e=>
xsi:schemaLocation="http://maven.apache.org/POM/4.0.0 http://maven.apache.org/xsd/maven-4.0.0.xsd"<https://urldefense.proofpoint.com/v2/url?u=http-3A__maven.apache.org_POM_4.0.0http-3A__maven.apache.org_xsd_maven-2D4.0.0.xsd&d=DQMF-g&c=8hUWFZcy2Z-Za5rBPlktOQ&r=cGMglYXcPR0IoSyYQ4AQ6bvD725xIPobF9W5B8eSXuA&m=sis435jfM7eIL7PsaunYcYuy437-8rSUbzt9GAWwPSg&s=PBaeHLYuyz9tT_Z2iPtAd6f423nUNCHXHGj0RUKJkTY&e=>>
<modelVersion>4.0.0</modelVersion>
<name>MyProduct - application product</name>
<artifactId>com.myProduct.app.product</artifactId>
<packaging>eclipse-repository</packaging>
<parent>
<groupId>com.myProduct</groupId>
<artifactId>com.myProduct.releng.parent</artifactId>
<version>0.1.0-SNAPSHOT</version>
<relativePath>../../releng/com.myProduct.releng.parent/pom.xml</relativePath>
</parent>

<build>
<plugins>
<plugin>
<groupId>org.eclipse.tycho</groupId>
<artifactId>tycho-p2-director-plugin</artifactId>
<version>${tycho-version}</version>
<executions>
<execution>
<id>materialize-products</id>
<goals>
<goal>materialize-products</goal>
</goals>
</execution>
<execution>
<id>archive-products</id>
<goals>
<goal>archive-products</goal>
</goals>
</execution>
</executions>
</plugin>
</plugins>
</build

On 10/6/2016 2:28 PM, Ken Keefe wrote:
I wrote a few days ago about trouble building features and that is working now. I'm on to the next task of trying to get my RCP product constructed from those features. It looks like Maven is saying it can't find the product. I don't understand how Maven/Tycho can put the project name defined by the artifactId in the pom to the product definition file (called core.project) file. I kept waiting for somewhere in the tutorial or other tutorials for a place to identify the product definition file, but it never came.

Any help in debugging this problem would be greatly appreciated. Here is the pom from the product project:

<project>
<modelVersion>4.0.0</modelVersion>
<parent>
<groupId>edu.illinois.mobius</groupId>
<artifactId>edu.illinois.mobius.releng</artifactId>
<version>1.0.0-SNAPSHOT</version>
</parent>

<groupId>edu.illinois.mobius</groupId>
<artifactId>edu.illinois.mobius.product.core</artifactId>
<packaging>eclipse-repository</packaging>
<version>1.0.0-SNAPSHOT</version>

<build>
<plugins>
<plugin>
<groupId>org.eclipse.tycho</groupId>
<artifactId>tycho-p2-repository-plugin</artifactId>
<version>${tycho.version}</version>
<configuration>
<includeAllDependencies>true</includeAllDependencies>
</configuration>
</plugin>
<plugin>
<groupId>org.eclipse.tycho</groupId>
<artifactId>tycho-p2-director-plugin</artifactId>
<version>${tycho.version}</version>
<executions>
<execution>
<id>materialize-products</id>
<goals>
<goal>materialize-products</goal>
</goals>
</execution>
<execution>
<id>archive-products</id>
<goals>
<goal>archive-products</goal>
</goals>
</execution>
</executions>
</plugin>
</plugins>
</build>
</project>

Here is the error output from maven:

[INFO] edu.illinois.mobius.product.core ................... FAILURE [ 0.262 s]
[INFO] ------------------------------------------------------------------------
[INFO] BUILD FAILURE
[INFO] ------------------------------------------------------------------------
[INFO] Total time: 38.834 s
[INFO] Finished at: 2016-10-06T13:21:59-05:00
[INFO] Final Memory: 286M/1288M
[INFO] ------------------------------------------------------------------------
[ERROR] Failed to execute goal org.eclipse.tycho:tycho-p2-repository-plugin:0.25.0:assemble-repository (default-assemble-repository) on project edu.illinois.mobius.product.core: Execution default-assemble-repository of goal org.eclipse.tycho:tycho-p2-repository-plugin:0.25.0:assemble-repository failed: Cannot resolve dependencies of MavenProject: edu.illinois.mobius:edu.illinois.mobius.product.core:1.0.0-SNAPSHOT @ /Users/kjkeefe/git/Mobius-4.6/releng/edu.illinois.mobius.product.core/pom.xml: See log for details -> [Help 1]
org.apache.maven.lifecycle.LifecycleExecutionException: Failed to execute goal org.eclipse.tycho:tycho-p2-repository-plugin:0.25.0:assemble-repository (default-assemble-repository) on project edu.illinois.mobius.product.core: Execution default-assemble-repository of goal org.eclipse.tycho:tycho-p2-repository-plugin:0.25.0:assemble-repository failed: Cannot resolve dependencies of MavenProject: edu.illinois.mobius:edu.illinois.mobius.product.core:1.0.0-SNAPSHOT @ /Users/kjkeefe/git/Mobius-4.6/releng/edu.illinois.mobius.product.core/pom.xml
at org.apache.maven.lifecycle.internal.MojoExecutor.execute(MojoExecutor.java:224)
at org.apache.maven.lifecycle.internal.MojoExecutor.execute(MojoExecutor.java:153)
at org.apache.maven.lifecycle.internal.MojoExecutor.execute(MojoExecutor.java:145)
at org.apache.maven.lifecycle.internal.LifecycleModuleBuilder.buildProject(LifecycleModuleBuilder.java:116)
at org.apache.maven.lifecycle.internal.LifecycleModuleBuilder.buildProject(LifecycleModuleBuilder.java:80)
at org.apache.maven.lifecycle.internal.builder.singlethreaded.SingleThreadedBuilder.build(SingleThreadedBuilder.java:51)
at org.apache.maven.lifecycle.internal.LifecycleStarter.execute(LifecycleStarter.java:128)
at org.apache.maven.DefaultMaven.doExecute(DefaultMaven.java:307)
at org.apache.maven.DefaultMaven.doExecute(DefaultMaven.java:193)
at org.apache.maven.DefaultMaven.execute(DefaultMaven.java:106)
at org.apache.maven.cli.MavenCli.execute(MavenCli.java:862)
at org.apache.maven.cli.MavenCli.doMain(MavenCli.java:286)
at org.apache.maven.cli.MavenCli.main(MavenCli.java:197)
at sun.reflect.NativeMethodAccessorImpl.invoke0(Native Method)
at sun.reflect.NativeMethodAccessorImpl.invoke(NativeMethodAccessorImpl.java:62)
at sun.reflect.DelegatingMethodAccessorImpl.invoke(DelegatingMethodAccessorImpl.java:43)
at java.lang.reflect.Method.invoke(Method.java:497)
at org.codehaus.plexus.classworlds.launcher.Launcher.launchEnhanced(Launcher.java:289)
at org.codehaus.plexus.classworlds.launcher.Launcher.launch(Launcher.java:229)
at org.codehaus.plexus.classworlds.launcher.Launcher.mainWithExitCode(Launcher.java:415)
at org.codehaus.plexus.classworlds.launcher.Launcher.main(Launcher.java:356)
Caused by: org.apache.maven.plugin.PluginExecutionException: Execution default-assemble-repository of goal org.eclipse.tycho:tycho-p2-repository-plugin:0.25.0:assemble-repository failed: Cannot resolve dependencies of MavenProject: edu.illinois.mobius:edu.illinois.mobius.product.core:1.0.0-SNAPSHOT @ /Users/kjkeefe/git/Mobius-4.6/releng/edu.illinois.mobius.product.core/pom.xml
at org.apache.maven.plugin.DefaultBuildPluginManager.executeMojo(DefaultBuildPluginManager.java:145)
at org.apache.maven.lifecycle.internal.MojoExecutor.execute(MojoExecutor.java:208)
... 20 more
Caused by: org.eclipse.tycho.artifacts.DependencyResolutionException: Cannot resolve dependencies of MavenProject: edu.illinois.mobius:edu.illinois.mobius.product.core:1.0.0-SNAPSHOT @ /Users/kjkeefe/git/Mobius-4.6/releng/edu.illinois.mobius.product.core/pom.xml
at org.eclipse.tycho.p2.resolver.P2ResolverImpl.resolveDependencies(P2ResolverImpl.java:202)
at org.eclipse.tycho.p2.resolver.P2ResolverImpl.resolveDependencies(P2ResolverImpl.java:116)
at org.eclipse.tycho.p2.resolver.P2DependencyResolver.doResolveDependencies(P2DependencyResolver.java:367)
at org.eclipse.tycho.p2.resolver.P2DependencyResolver.resolveDependencies(P2DependencyResolver.java:335)
at org.eclipse.tycho.p2.facade.RepositoryReferenceTool.addTargetPlatformRepository(RepositoryReferenceTool.java:124)
at org.eclipse.tycho.p2.facade.RepositoryReferenceTool.getVisibleRepositories(RepositoryReferenceTool.java:96)
at org.eclipse.tycho.plugins.p2.repository.AssembleRepositoryMojo.getVisibleRepositories(AssembleRepositoryMojo.java:165)
at org.eclipse.tycho.plugins.p2.repository.AssembleRepositoryMojo.execute(AssembleRepositoryMojo.java:137)
at org.apache.maven.plugin.DefaultBuildPluginManager.executeMojo(DefaultBuildPluginManager.java:134)
... 21 more
Caused by: org.eclipse.tycho.p2.util.resolution.ResolverException: See log for details
at org.eclipse.tycho.p2.util.resolution.ProjectorResolutionStrategy.resolve(ProjectorResolutionStrategy.java:88)
at org.eclipse.tycho.p2.util.resolution.AbstractResolutionStrategy.resolve(AbstractResolutionStrategy.java:42)
at org.eclipse.tycho.p2.resolver.P2ResolverImpl.resolveDependencies(P2ResolverImpl.java:195)
... 29 more
[ERROR]
[ERROR]
[ERROR] For more information about the errors and possible solutions, please read the following articles:
[ERROR] [Help 1] http://cwiki.apache.org/confluence/display/MAVEN/PluginExecutionException<https://urldefense.proofpoint.com/v2/url?u=http-3A__cwiki.apache.org_confluence_display_MAVEN_PluginExecutionException&d=DQMF-g&c=8hUWFZcy2Z-Za5rBPlktOQ&r=cGMglYXcPR0IoSyYQ4AQ6bvD725xIPobF9W5B8eSXuA&m=sis435jfM7eIL7PsaunYcYuy437-8rSUbzt9GAWwPSg&s=EH1aDCtIwr0eRU6dwj6VWOuwp4BpShrOe8aRJd79XHw&e=>
[ERROR]
[ERROR] After correcting the problems, you can resume the build with the command
[ERROR] mvn <goals> -rf :edu.illinois.mobius.product.core



_______________________________________________
tycho-user mailing list
tycho-***@eclipse.org<mailto:tycho-***@eclipse.org>
To change your delivery options, retrieve your password, or unsubscribe from this list, visit
https://dev.eclipse.org/mailman/listinfo/tycho-user<https://urldefense.proofpoint.com/v2/url?u=https-3A__dev.eclipse.org_mailman_listinfo_tycho-2Duser&d=DQMF-g&c=8hUWFZcy2Z-Za5rBPlktOQ&r=cGMglYXcPR0IoSyYQ4AQ6bvD725xIPobF9W5B8eSXuA&m=sis435jfM7eIL7PsaunYcYuy437-8rSUbzt9GAWwPSg&s=GBw94hWU4AeGz-yzWQmF9V4c7-s_GFAOtgzpOvtW8K8&e=>
--
The people that bring you Usque<https://urldefense.proofpoint.com/v2/url?u=http-3A__Usque.software_&d=DQMF-g&c=8hUWFZcy2Z-Za5rBPlktOQ&r=cGMglYXcPR0IoSyYQ4AQ6bvD725xIPobF9W5B8eSXuA&m=sis435jfM7eIL7PsaunYcYuy437-8rSUbzt9GAWwPSg&s=DA0GFwDciDupaVdO4Wz43---Fm7JVKAUGTQE4v5NWUw&e=>.

_______________________________________________
tycho-user mailing list
tycho-***@eclipse.org<mailto:tycho-***@eclipse.org>
To change your delivery options, retrieve your password, or unsubscribe from this list, visit
https://dev.eclipse.org/mailman/listinfo/tycho-user
Ken Keefe
2016-10-06 21:42:20 UTC
Permalink
mvn clean install gives me the same error.

[ERROR] Failed to execute goal
org.eclipse.tycho:tycho-p2-repository-plugin:0.25.0:assemble-repository
(default-assemble-repository) on project edu.illinois.mobius.update:
Execution default-assemble-repository of goal
org.eclipse.tycho:tycho-p2-repository-plugin:0.25.0:assemble-repository
failed: Cannot resolve dependencies of MavenProject:
edu.illinois.mobius:edu.illinois.mobius.update:2.6.0-SNAPSHOT @
/Users/kjkeefe/git/Mobius-4.6/releng/edu.illinois.mobius.update/pom.xml:
See log for details -> [Help 1]
[ERROR]
[ERROR] To see the full stack trace of the errors, re-run Maven with the -e
switch.
[ERROR] Re-run Maven using the -X switch to enable full debug logging.
[ERROR]
[ERROR] For more information about the errors and possible solutions,
please read the following articles:
[ERROR] [Help 1]
http://cwiki.apache.org/confluence/display/MAVEN/PluginExecutionException
[ERROR]
[ERROR] After correcting the problems, you can resume the build with the
command
[ERROR] mvn <goals> -rf :edu.illinois.mobius.update

Ken
Post by Tom Bryan (tombry)
Did you try to do an install instead?
mvn clean install
---Tom
Date: Thursday, October 6, 2016 at 4:34 PM
Subject: Re: [tycho-user] Trouble building an RCP product
http://www.vogella.com/tutorials/EclipseTycho/article.html#run-the-build
<https://urldefense.proofpoint.com/v2/url?u=http-3A__www.vogella.com_tutorials_EclipseTycho_article.html-23run-2Dthe-2Dbuild&d=DQMGaQ&c=8hUWFZcy2Z-Za5rBPlktOQ&r=cGMglYXcPR0IoSyYQ4AQ6bvD725xIPobF9W5B8eSXuA&m=pchSQ8yeIK-W_ODin3-D0TaiiDCAFiW67aADwp4RPo0&s=f4dUoxTJzoltVu8G-ZrjWRXTxJmd7ep8gV_2AiVSeeg&e=>
I get the same sort of error saying it cannot resolve the dependencies. I
decided to change the category.xml file around to see if I could narrow
down the problem. I ended up removing all of my features and adding one of
the features in the build target (I randomly picked org.eclipse.cvs). This
builds correctly and I can see the new p2 repository with the cvs feature
and its plugins looking all correct.
When I remove that cvs feature and add just one of my features, it goes
back to the same error. Is there something I need to do to tell Maven where
to find my features? They are built just prior to it trying to create the
update site. I'm using the directory structure that vogella suggests, so my
recently constructed feature lives in features/edu.illinois.mobius.feature/target/
.
To initiate the maven build, I am using "mvn clean verify".
Thoughts?
Ken
[ERROR] Failed to execute goal org.eclipse.tycho:tycho-p2-
repository-plugin:0.25.0:assemble-repository
Execution default-assemble-repository of goal org.eclipse.tycho:tycho-p2-
repository-plugin:0.25.0:assemble-repository failed: Cannot resolve
dependencies of MavenProject: edu.illinois.mobius:edu.
releng/edu.illinois.mobius.update/pom.xml: See log for details -> [Help 1]
[ERROR]
[ERROR] To see the full stack trace of the errors, re-run Maven with the -e switch.
[ERROR] Re-run Maven using the -X switch to enable full debug logging.
[ERROR]
[ERROR] For more information about the errors and possible solutions,
[ERROR] [Help 1] http://cwiki.apache.org/confluence/display/MAVEN/
PluginExecutionException
<https://urldefense.proofpoint.com/v2/url?u=http-3A__cwiki.apache.org_confluence_display_MAVEN_PluginExecutionException&d=DQMGaQ&c=8hUWFZcy2Z-Za5rBPlktOQ&r=cGMglYXcPR0IoSyYQ4AQ6bvD725xIPobF9W5B8eSXuA&m=pchSQ8yeIK-W_ODin3-D0TaiiDCAFiW67aADwp4RPo0&s=yxjjr0MESlUXVGswDCbWO322NI1P2j_itGcBjl_hQ7U&e=>
[ERROR]
[ERROR] After correcting the problems, you can resume the build with the command
[ERROR] mvn <goals> -rf :edu.illinois.mobius.update
Post by Paul Roubekas
Here is mine that has been working for months.
<project xmlns="http://maven.apache.org/POM/4.0.0"
<https://urldefense.proofpoint.com/v2/url?u=http-3A__maven.apache.org_POM_4.0.0&d=DQMF-g&c=8hUWFZcy2Z-Za5rBPlktOQ&r=cGMglYXcPR0IoSyYQ4AQ6bvD725xIPobF9W5B8eSXuA&m=sis435jfM7eIL7PsaunYcYuy437-8rSUbzt9GAWwPSg&s=WwDOMXWIK-IYohDaP3089uFxsfnXWi7hhPh1rmJ62Ow&e=>
xmlns:xsi="http://www.w3.org/2001/XMLSchema-instance"
<https://urldefense.proofpoint.com/v2/url?u=http-3A__www.w3.org_2001_XMLSchema-2Dinstance&d=DQMF-g&c=8hUWFZcy2Z-Za5rBPlktOQ&r=cGMglYXcPR0IoSyYQ4AQ6bvD725xIPobF9W5B8eSXuA&m=sis435jfM7eIL7PsaunYcYuy437-8rSUbzt9GAWwPSg&s=XaWYV69YMr4riOBOXDjFSEFzayYgSalXvSA29hXhIMk&e=>
xsi:schemaLocation="http://maven.apache.org/POM/4.0.0
http://maven.apache.org/xsd/maven-4.0.0.xsd"
<https://urldefense.proofpoint.com/v2/url?u=http-3A__maven.apache.org_POM_4.0.0http-3A__maven.apache.org_xsd_maven-2D4.0.0.xsd&d=DQMF-g&c=8hUWFZcy2Z-Za5rBPlktOQ&r=cGMglYXcPR0IoSyYQ4AQ6bvD725xIPobF9W5B8eSXuA&m=sis435jfM7eIL7PsaunYcYuy437-8rSUbzt9GAWwPSg&s=PBaeHLYuyz9tT_Z2iPtAd6f423nUNCHXHGj0RUKJkTY&e=>
<modelVersion>4.0.0</modelVersion>
<name>MyProduct - application product</name>
<artifactId>com.myProduct.app.product</artifactId>
<packaging>eclipse-repository</packaging>
<parent>
<groupId>com.myProduct</groupId>
<artifactId>com.myProduct.releng.parent</artifactId>
<version>0.1.0-SNAPSHOT</version>
<relativePath>../../releng/com.myProduct.releng.parent/pom.
xml</relativePath>
</parent>
<build>
<plugins>
<plugin>
<groupId>org.eclipse.tycho</groupId>
<artifactId>tycho-p2-director-plugin</artifactId>
<version>${tycho-version}</version>
<executions>
<execution>
<id>materialize-products</id>
<goals>
<goal>materialize-products</goal>
</goals>
</execution>
<execution>
<id>archive-products</id>
<goals>
<goal>archive-products</goal>
</goals>
</execution>
</executions>
</plugin>
</plugins>
</build
I wrote a few days ago about trouble building features and that is
working now. I'm on to the next task of trying to get my RCP product
constructed from those features. It looks like Maven is saying it can't
find the product. I don't understand how Maven/Tycho can put the project
name defined by the artifactId in the pom to the product definition file
(called core.project) file. I kept waiting for somewhere in the tutorial or
other tutorials for a place to identify the product definition file, but it
never came.
Any help in debugging this problem would be greatly appreciated. Here is
<project>
<modelVersion>4.0.0</modelVersion>
<parent>
<groupId>edu.illinois.mobius</groupId>
<artifactId>edu.illinois.mobius.releng</artifactId>
<version>1.0.0-SNAPSHOT</version>
</parent>
<groupId>edu.illinois.mobius</groupId>
<artifactId>edu.illinois.mobius.product.core</artifactId>
<packaging>eclipse-repository</packaging>
<version>1.0.0-SNAPSHOT</version>
<build>
<plugins>
<plugin>
<groupId>org.eclipse.tycho</groupId>
<artifactId>tycho-p2-repository-plugin</artifactId>
<version>${tycho.version}</version>
<configuration>
<includeAllDependencies>true</includeAllDependencies>
</configuration>
</plugin>
<plugin>
<groupId>org.eclipse.tycho</groupId>
<artifactId>tycho-p2-director-plugin</artifactId>
<version>${tycho.version}</version>
<executions>
<execution>
<id>materialize-products</id>
<goals>
<goal>materialize-products</goal>
</goals>
</execution>
<execution>
<id>archive-products</id>
<goals>
<goal>archive-products</goal>
</goals>
</execution>
</executions>
</plugin>
</plugins>
</build>
</project>
[INFO] edu.illinois.mobius.product.core ................... FAILURE [
0.262 s]
[INFO] ------------------------------------------------------------
------------
[INFO] BUILD FAILURE
[INFO] ------------------------------------------------------------
------------
[INFO] Total time: 38.834 s
[INFO] Finished at: 2016-10-06T13:21:59-05:00
[INFO] Final Memory: 286M/1288M
[INFO] ------------------------------------------------------------
------------
[ERROR] Failed to execute goal org.eclipse.tycho:tycho-p2-rep
ository-plugin:0.25.0:assemble-repository (default-assemble-repository)
on project edu.illinois.mobius.product.core: Execution
default-assemble-repository of goal org.eclipse.tycho:tycho-p2-rep
ository-plugin:0.25.0:assemble-repository failed: Cannot resolve
dependencies of MavenProject: edu.illinois.mobius:edu.illino
releng/edu.illinois.mobius.product.core/pom.xml: See log for details ->
[Help 1]
org.apache.maven.lifecycle.LifecycleExecutionException: Failed to
execute goal org.eclipse.tycho:tycho-p2-repository-plugin:0.25.0:assemble-repository
Execution default-assemble-repository of goal org.eclipse.tycho:tycho-p2-rep
ository-plugin:0.25.0:assemble-repository failed: Cannot resolve
dependencies of MavenProject: edu.illinois.mobius:edu.illino
releng/edu.illinois.mobius.product.core/pom.xml
at org.apache.maven.lifecycle.internal.MojoExecutor.execute(Moj
oExecutor.java:224)
at org.apache.maven.lifecycle.internal.MojoExecutor.execute(Moj
oExecutor.java:153)
at org.apache.maven.lifecycle.internal.MojoExecutor.execute(Moj
oExecutor.java:145)
at org.apache.maven.lifecycle.internal.LifecycleModuleBuilder.b
uildProject(LifecycleModuleBuilder.java:116)
at org.apache.maven.lifecycle.internal.LifecycleModuleBuilder.b
uildProject(LifecycleModuleBuilder.java:80)
at org.apache.maven.lifecycle.internal.builder.singlethreaded.S
ingleThreadedBuilder.build(SingleThreadedBuilder.java:51)
at org.apache.maven.lifecycle.internal.LifecycleStarter.execute
(LifecycleStarter.java:128)
at org.apache.maven.DefaultMaven.doExecute(DefaultMaven.java:307)
at org.apache.maven.DefaultMaven.doExecute(DefaultMaven.java:193)
at org.apache.maven.DefaultMaven.execute(DefaultMaven.java:106)
at org.apache.maven.cli.MavenCli.execute(MavenCli.java:862)
at org.apache.maven.cli.MavenCli.doMain(MavenCli.java:286)
at org.apache.maven.cli.MavenCli.main(MavenCli.java:197)
at sun.reflect.NativeMethodAccessorImpl.invoke0(Native Method)
at sun.reflect.NativeMethodAccessorImpl.invoke(NativeMethodAcce
ssorImpl.java:62)
at sun.reflect.DelegatingMethodAccessorImpl.invoke(DelegatingMe
thodAccessorImpl.java:43)
at java.lang.reflect.Method.invoke(Method.java:497)
at org.codehaus.plexus.classworlds.launcher.Launcher.launchEnha
nced(Launcher.java:289)
at org.codehaus.plexus.classworlds.launcher.Launcher.launch(
Launcher.java:229)
at org.codehaus.plexus.classworlds.launcher.Launcher.mainWithEx
itCode(Launcher.java:415)
at org.codehaus.plexus.classworlds.launcher.Launcher.main(
Launcher.java:356)
Caused by: org.apache.maven.plugin.PluginExecutionException: Execution
default-assemble-repository of goal org.eclipse.tycho:tycho-p2-rep
ository-plugin:0.25.0:assemble-repository failed: Cannot resolve
dependencies of MavenProject: edu.illinois.mobius:edu.illino
releng/edu.illinois.mobius.product.core/pom.xml
at org.apache.maven.plugin.DefaultBuildPluginManager.executeMoj
o(DefaultBuildPluginManager.java:145)
at org.apache.maven.lifecycle.internal.MojoExecutor.execute(Moj
oExecutor.java:208)
... 20 more
Cannot resolve dependencies of MavenProject: edu.illinois.mobius:edu.illino
releng/edu.illinois.mobius.product.core/pom.xml
at org.eclipse.tycho.p2.resolver.P2ResolverImpl.resolveDependen
cies(P2ResolverImpl.java:202)
at org.eclipse.tycho.p2.resolver.P2ResolverImpl.resolveDependen
cies(P2ResolverImpl.java:116)
at org.eclipse.tycho.p2.resolver.P2DependencyResolver.doResolve
Dependencies(P2DependencyResolver.java:367)
at org.eclipse.tycho.p2.resolver.P2DependencyResolver.resolveDe
pendencies(P2DependencyResolver.java:335)
at org.eclipse.tycho.p2.facade.RepositoryReferenceTool.addTarge
tPlatformRepository(RepositoryReferenceTool.java:124)
at org.eclipse.tycho.p2.facade.RepositoryReferenceTool.getVisib
leRepositories(RepositoryReferenceTool.java:96)
at org.eclipse.tycho.plugins.p2.repository.AssembleRepositoryMo
jo.getVisibleRepositories(AssembleRepositoryMojo.java:165)
at org.eclipse.tycho.plugins.p2.repository.AssembleRepositoryMo
jo.execute(AssembleRepositoryMojo.java:137)
at org.apache.maven.plugin.DefaultBuildPluginManager.executeMoj
o(DefaultBuildPluginManager.java:134)
... 21 more
Caused by: org.eclipse.tycho.p2.util.resolution.ResolverException: See log for details
at org.eclipse.tycho.p2.util.resolution.ProjectorResolutionStra
tegy.resolve(ProjectorResolutionStrategy.java:88)
at org.eclipse.tycho.p2.util.resolution.AbstractResolutionStrat
egy.resolve(AbstractResolutionStrategy.java:42)
at org.eclipse.tycho.p2.resolver.P2ResolverImpl.resolveDependen
cies(P2ResolverImpl.java:195)
... 29 more
[ERROR]
[ERROR]
[ERROR] For more information about the errors and possible solutions,
[ERROR] [Help 1] http://cwiki.apache.org/conflu
ence/display/MAVEN/PluginExecutionException
<https://urldefense.proofpoint.com/v2/url?u=http-3A__cwiki.apache.org_confluence_display_MAVEN_PluginExecutionException&d=DQMF-g&c=8hUWFZcy2Z-Za5rBPlktOQ&r=cGMglYXcPR0IoSyYQ4AQ6bvD725xIPobF9W5B8eSXuA&m=sis435jfM7eIL7PsaunYcYuy437-8rSUbzt9GAWwPSg&s=EH1aDCtIwr0eRU6dwj6VWOuwp4BpShrOe8aRJd79XHw&e=>
[ERROR]
[ERROR] After correcting the problems, you can resume the build with the command
[ERROR] mvn <goals> -rf :edu.illinois.mobius.product.core
_______________________________________________
tycho-user mailing list
To change your delivery options, retrieve your password, or unsubscribe from this list, visit
https://dev.eclipse.org/mailman/listinfo/tycho-user <https://urldefense.proofpoint.com/v2/url?u=https-3A__dev.eclipse.org_mailman_listinfo_tycho-2Duser&d=DQMF-g&c=8hUWFZcy2Z-Za5rBPlktOQ&r=cGMglYXcPR0IoSyYQ4AQ6bvD725xIPobF9W5B8eSXuA&m=sis435jfM7eIL7PsaunYcYuy437-8rSUbzt9GAWwPSg&s=GBw94hWU4AeGz-yzWQmF9V4c7-s_GFAOtgzpOvtW8K8&e=>
--
The people that bring you Usque
<https://urldefense.proofpoint.com/v2/url?u=http-3A__Usque.software_&d=DQMF-g&c=8hUWFZcy2Z-Za5rBPlktOQ&r=cGMglYXcPR0IoSyYQ4AQ6bvD725xIPobF9W5B8eSXuA&m=sis435jfM7eIL7PsaunYcYuy437-8rSUbzt9GAWwPSg&s=DA0GFwDciDupaVdO4Wz43---Fm7JVKAUGTQE4v5NWUw&e=>
.
_______________________________________________
tycho-user mailing list
To change your delivery options, retrieve your password, or unsubscribe
from this list, visit
https://dev.eclipse.org/mailman/listinfo/tycho-user
<https://urldefense.proofpoint.com/v2/url?u=https-3A__dev.eclipse.org_mailman_listinfo_tycho-2Duser&d=DQMGaQ&c=8hUWFZcy2Z-Za5rBPlktOQ&r=cGMglYXcPR0IoSyYQ4AQ6bvD725xIPobF9W5B8eSXuA&m=pchSQ8yeIK-W_ODin3-D0TaiiDCAFiW67aADwp4RPo0&s=llnfZ30ieDrc3w8Rad79vcmZp5UoLOj8UR91JdAAmOw&e=>
_______________________________________________
tycho-user mailing list
To change your delivery options, retrieve your password, or unsubscribe
from this list, visit
https://dev.eclipse.org/mailman/listinfo/tycho-user
Tom Bryan (tombry)
2016-10-06 21:56:20 UTC
Permalink
I was probably unclear. Unless your edu.illinois.mobius:edu.illinois.mobius.update project also builds everything, I don’t think that it will find its dependencies unless they’re part of the target platform, available in your project’s p2 update site repositories, or installed to your local maven repository.

Therefore, I suspect that you’ll either need to build the plugins and feature and create the update site as part of a single Maven reactor,
Or
You’ll need to use the “install” goal while building the plugins, features, and products. That way, when you later run Maven on your update project that builds the update site, it will find the plugins, features, and other artifacts that you just built in the maven repository.

---Tom

From: <tycho-user-***@eclipse.org<mailto:tycho-user-***@eclipse.org>> on behalf of Ken Keefe <***@illinois.edu<mailto:***@illinois.edu>>
Reply-To: Tycho user list <tycho-***@eclipse.org<mailto:tycho-***@eclipse.org>>
Date: Thursday, October 6, 2016 at 5:42 PM
To: Tycho user list <tycho-***@eclipse.org<mailto:tycho-***@eclipse.org>>
Subject: Re: [tycho-user] Trouble building an RCP product

mvn clean install gives me the same error.

[ERROR] Failed to execute goal org.eclipse.tycho:tycho-p2-repository-plugin:0.25.0:assemble-repository (default-assemble-repository) on project edu.illinois.mobius.update: Execution default-assemble-repository of goal org.eclipse.tycho:tycho-p2-repository-plugin:0.25.0:assemble-repository failed: Cannot resolve dependencies of MavenProject: edu.illinois.mobius:edu.illinois.mobius.update:2.6.0-SNAPSHOT @ /Users/kjkeefe/git/Mobius-4.6/releng/edu.illinois.mobius.update/pom.xml: See log for details -> [Help 1]
[ERROR]
[ERROR] To see the full stack trace of the errors, re-run Maven with the -e switch.
[ERROR] Re-run Maven using the -X switch to enable full debug logging.
[ERROR]
[ERROR] For more information about the errors and possible solutions, please read the following articles:
[ERROR] [Help 1] http://cwiki.apache.org/confluence/display/MAVEN/PluginExecutionException
[ERROR]
[ERROR] After correcting the problems, you can resume the build with the command
[ERROR] mvn <goals> -rf :edu.illinois.mobius.update

Ken

On Thu, Oct 6, 2016 at 2:08 PM, Tom Bryan (tombry) <***@cisco.com<mailto:***@cisco.com>> wrote:
Did you try to do an install instead?
mvn clean install

---Tom

From: <tycho-user-***@eclipse.org<mailto:tycho-user-***@eclipse.org>> on behalf of Ken Keefe <***@illinois.edu<mailto:***@illinois.edu>>
Reply-To: Tycho user list <tycho-***@eclipse.org<mailto:tycho-***@eclipse.org>>
Date: Thursday, October 6, 2016 at 4:34 PM
To: Tycho user list <tycho-***@eclipse.org<mailto:tycho-***@eclipse.org>>
Subject: Re: [tycho-user] Trouble building an RCP product

I switched to trying update site part of the vogella tutorial: http://www.vogella.com/tutorials/EclipseTycho/article.html#run-the-build<https://urldefense.proofpoint.com/v2/url?u=http-3A__www.vogella.com_tutorials_EclipseTycho_article.html-23run-2Dthe-2Dbuild&d=DQMGaQ&c=8hUWFZcy2Z-Za5rBPlktOQ&r=cGMglYXcPR0IoSyYQ4AQ6bvD725xIPobF9W5B8eSXuA&m=pchSQ8yeIK-W_ODin3-D0TaiiDCAFiW67aADwp4RPo0&s=f4dUoxTJzoltVu8G-ZrjWRXTxJmd7ep8gV_2AiVSeeg&e=>

I get the same sort of error saying it cannot resolve the dependencies. I decided to change the category.xml file around to see if I could narrow down the problem. I ended up removing all of my features and adding one of the features in the build target (I randomly picked org.eclipse.cvs). This builds correctly and I can see the new p2 repository with the cvs feature and its plugins looking all correct.

When I remove that cvs feature and add just one of my features, it goes back to the same error. Is there something I need to do to tell Maven where to find my features? They are built just prior to it trying to create the update site. I'm using the directory structure that vogella suggests, so my recently constructed feature lives in features/edu.illinois.mobius.feature/target/ .

To initiate the maven build, I am using "mvn clean verify".

Thoughts?

Ken

[ERROR] Failed to execute goal org.eclipse.tycho:tycho-p2-repository-plugin:0.25.0:assemble-repository (default-assemble-repository) on project edu.illinois.mobius.update: Execution default-assemble-repository of goal org.eclipse.tycho:tycho-p2-repository-plugin:0.25.0:assemble-repository failed: Cannot resolve dependencies of MavenProject: edu.illinois.mobius:edu.illinois.mobius.update:2.6.0-SNAPSHOT @ /Users/kjkeefe/git/Mobius-4.6/releng/edu.illinois.mobius.update/pom.xml: See log for details -> [Help 1]
[ERROR]
[ERROR] To see the full stack trace of the errors, re-run Maven with the -e switch.
[ERROR] Re-run Maven using the -X switch to enable full debug logging.
[ERROR]
[ERROR] For more information about the errors and possible solutions, please read the following articles:
[ERROR] [Help 1] http://cwiki.apache.org/confluence/display/MAVEN/PluginExecutionException<https://urldefense.proofpoint.com/v2/url?u=http-3A__cwiki.apache.org_confluence_display_MAVEN_PluginExecutionException&d=DQMGaQ&c=8hUWFZcy2Z-Za5rBPlktOQ&r=cGMglYXcPR0IoSyYQ4AQ6bvD725xIPobF9W5B8eSXuA&m=pchSQ8yeIK-W_ODin3-D0TaiiDCAFiW67aADwp4RPo0&s=yxjjr0MESlUXVGswDCbWO322NI1P2j_itGcBjl_hQ7U&e=>
[ERROR]
[ERROR] After correcting the problems, you can resume the build with the command
[ERROR] mvn <goals> -rf :edu.illinois.mobius.update



On Thu, Oct 6, 2016 at 12:45 PM, Paul Roubekas <***@orthogroup.holdings<mailto:***@orthogroup.holdings>> wrote:
Here is mine that has been working for months.


<project xmlns="http://maven.apache.org/POM/4.0.0"<https://urldefense.proofpoint.com/v2/url?u=http-3A__maven.apache.org_POM_4.0.0&d=DQMF-g&c=8hUWFZcy2Z-Za5rBPlktOQ&r=cGMglYXcPR0IoSyYQ4AQ6bvD725xIPobF9W5B8eSXuA&m=sis435jfM7eIL7PsaunYcYuy437-8rSUbzt9GAWwPSg&s=WwDOMXWIK-IYohDaP3089uFxsfnXWi7hhPh1rmJ62Ow&e=> xmlns:xsi="http://www.w3.org/2001/XMLSchema-instance"<https://urldefense.proofpoint.com/v2/url?u=http-3A__www.w3.org_2001_XMLSchema-2Dinstance&d=DQMF-g&c=8hUWFZcy2Z-Za5rBPlktOQ&r=cGMglYXcPR0IoSyYQ4AQ6bvD725xIPobF9W5B8eSXuA&m=sis435jfM7eIL7PsaunYcYuy437-8rSUbzt9GAWwPSg&s=XaWYV69YMr4riOBOXDjFSEFzayYgSalXvSA29hXhIMk&e=>
xsi:schemaLocation="http://maven.apache.org/POM/4.0.0 http://maven.apache.org/xsd/maven-4.0.0.xsd"<https://urldefense.proofpoint.com/v2/url?u=http-3A__maven.apache.org_POM_4.0.0http-3A__maven.apache.org_xsd_maven-2D4.0.0.xsd&d=DQMF-g&c=8hUWFZcy2Z-Za5rBPlktOQ&r=cGMglYXcPR0IoSyYQ4AQ6bvD725xIPobF9W5B8eSXuA&m=sis435jfM7eIL7PsaunYcYuy437-8rSUbzt9GAWwPSg&s=PBaeHLYuyz9tT_Z2iPtAd6f423nUNCHXHGj0RUKJkTY&e=>>
<modelVersion>4.0.0</modelVersion>
<name>MyProduct - application product</name>
<artifactId>com.myProduct.app.product</artifactId>
<packaging>eclipse-repository</packaging>
<parent>
<groupId>com.myProduct</groupId>
<artifactId>com.myProduct.releng.parent</artifactId>
<version>0.1.0-SNAPSHOT</version>
<relativePath>../../releng/com.myProduct.releng.parent/pom.xml</relativePath>
</parent>

<build>
<plugins>
<plugin>
<groupId>org.eclipse.tycho</groupId>
<artifactId>tycho-p2-director-plugin</artifactId>
<version>${tycho-version}</version>
<executions>
<execution>
<id>materialize-products</id>
<goals>
<goal>materialize-products</goal>
</goals>
</execution>
<execution>
<id>archive-products</id>
<goals>
<goal>archive-products</goal>
</goals>
</execution>
</executions>
</plugin>
</plugins>
</build

On 10/6/2016 2:28 PM, Ken Keefe wrote:
I wrote a few days ago about trouble building features and that is working now. I'm on to the next task of trying to get my RCP product constructed from those features. It looks like Maven is saying it can't find the product. I don't understand how Maven/Tycho can put the project name defined by the artifactId in the pom to the product definition file (called core.project) file. I kept waiting for somewhere in the tutorial or other tutorials for a place to identify the product definition file, but it never came.

Any help in debugging this problem would be greatly appreciated. Here is the pom from the product project:

<project>
<modelVersion>4.0.0</modelVersion>
<parent>
<groupId>edu.illinois.mobius</groupId>
<artifactId>edu.illinois.mobius.releng</artifactId>
<version>1.0.0-SNAPSHOT</version>
</parent>

<groupId>edu.illinois.mobius</groupId>
<artifactId>edu.illinois.mobi<http://edu.illinois.mobi>us.product.core</artifactId>
<packaging>eclipse-repository</packaging>
<version>1.0.0-SNAPSHOT</version>

<build>
<plugins>
<plugin>
<groupId>org.eclipse.tycho</groupId>
<artifactId>tycho-p2-repository-plugin</artifactId>
<version>${tycho.version}</version>
<configuration>
<includeAllDependencies>true</includeAllDependencies>
</configuration>
</plugin>
<plugin>
<groupId>org.eclipse.tycho</groupId>
<artifactId>tycho-p2-director-plugin</artifactId>
<version>${tycho.version}</version>
<executions>
<execution>
<id>materialize-products</id>
<goals>
<goal>materialize-products</goal>
</goals>
</execution>
<execution>
<id>archive-products</id>
<goals>
<goal>archive-products</goal>
</goals>
</execution>
</executions>
</plugin>
</plugins>
</build>
</project>

Here is the error output from maven:

[INFO] edu.illinois.mobius.product.co<http://edu.illinois.mobius.product.co>re ................... FAILURE [ 0.262 s]
[INFO] ------------------------------------------------------------------------
[INFO] BUILD FAILURE
[INFO] ------------------------------------------------------------------------
[INFO] Total time: 38.834 s
[INFO] Finished at: 2016-10-06T13:21:59-05:00
[INFO] Final Memory: 286M/1288M
[INFO] ------------------------------------------------------------------------
[ERROR] Failed to execute goal org.eclipse.tycho:tycho-p2-repository-plugin:0.25.0:assemble-repository (default-assemble-repository) on project edu.illinois.mobius.product.co<http://edu.illinois.mobius.product.co>re: Execution default-assemble-repository of goal org.eclipse.tycho:tycho-p2-repository-plugin:0.25.0:assemble-repository failed: Cannot resolve dependencies of MavenProject: edu.illinois.mobius:edu.illinois.mobius.product.core:1.0.0-SNAPSHOT @ /Users/kjkeefe/git/Mobius-4.6/releng/edu.illinois.mobius.pro<http://edu.illinois.mobius.pro>duct.core/pom.xml: See log for details -> [Help 1]
org.apache.maven.lifecycle.LifecycleExecutionException: Failed to execute goal org.eclipse.tycho:tycho-p2-repository-plugin:0.25.0:assemble-repository (default-assemble-repository) on project edu.illinois.mobius.product.co<http://edu.illinois.mobius.product.co>re: Execution default-assemble-repository of goal org.eclipse.tycho:tycho-p2-repository-plugin:0.25.0:assemble-repository failed: Cannot resolve dependencies of MavenProject: edu.illinois.mobius:edu.illinois.mobius.product.core:1.0.0-SNAPSHOT @ /Users/kjkeefe/git/Mobius-4.6/releng/edu.illinois.mobius.pro<http://edu.illinois.mobius.pro>duct.core/pom.xml
at org.apache.maven.lifecycle.int<http://org.apache.maven.lifecycle.int>ernal.MojoExecutor.execute(MojoExecutor.java:224)
at org.apache.maven.lifecycle.int<http://org.apache.maven.lifecycle.int>ernal.MojoExecutor.execute(MojoExecutor.java:153)
at org.apache.maven.lifecycle.int<http://org.apache.maven.lifecycle.int>ernal.MojoExecutor.execute(MojoExecutor.java:145)
at org.apache.maven.lifecycle.int<http://org.apache.maven.lifecycle.int>ernal.LifecycleModuleBuilder.buildProject(LifecycleModuleBuilder.java:116)
at org.apache.maven.lifecycle.int<http://org.apache.maven.lifecycle.int>ernal.LifecycleModuleBuilder.buildProject(LifecycleModuleBuilder.java:80)
at org.apache.maven.lifecycle.int<http://org.apache.maven.lifecycle.int>ernal.builder.singlethreaded.SingleThreadedBuilder.build(SingleThreadedBuilder.java:51)
at org.apache.maven.lifecycle.int<http://org.apache.maven.lifecycle.int>ernal.LifecycleStarter.execute(LifecycleStarter.java:128)
at org.apache.maven.DefaultMaven.doExecute(DefaultMaven.java:307)
at org.apache.maven.DefaultMaven.doExecute(DefaultMaven.java:193)
at org.apache.maven.DefaultMaven.execute(DefaultMaven.java:106)
at org.apache.maven.cli.MavenCli.execute(MavenCli.java:862)
at org.apache.maven.cli.MavenCli.doMain(MavenCli.java:286)
at org.apache.maven.cli.MavenCli.main(MavenCli.java:197)
at sun.reflect.NativeMethodAccessorImpl.invoke0(Native Method)
at sun.reflect.NativeMethodAccessorImpl.invoke(NativeMethodAccessorImpl.java:62)
at sun.reflect.DelegatingMethodAccessorImpl.invoke(DelegatingMethodAccessorImpl.java:43)
at java.lang.reflect.Method.invoke(Method.java:497)
at org.codehaus.plexus.classworlds.launcher.Launcher.launchEnhanced(Launcher.java:289)
at org.codehaus.plexus.classworlds.launcher.Launcher.launch(Launcher.java:229)
at org.codehaus.plexus.classworlds.launcher.Launcher.mainWithExitCode(Launcher.java:415)
at org.codehaus.plexus.classworlds.launcher.Launcher.main(Launcher.java:356)
Caused by: org.apache.maven.plugin.PluginExecutionException: Execution default-assemble-repository of goal org.eclipse.tycho:tycho-p2-repository-plugin:0.25.0:assemble-repository failed: Cannot resolve dependencies of MavenProject: edu.illinois.mobius:edu.illinois.mobius.product.core:1.0.0-SNAPSHOT @ /Users/kjkeefe/git/Mobius-4.6/releng/edu.illinois.mobius.pro<http://edu.illinois.mobius.pro>duct.core/pom.xml
at org.apache.maven.plugin.DefaultBuildPluginManager.executeMojo(DefaultBuildPluginManager.java:145)
at org.apache.maven.lifecycle.int<http://org.apache.maven.lifecycle.int>ernal.MojoExecutor.execute(MojoExecutor.java:208)
... 20 more
Caused by: org.eclipse.tycho.artifacts.De<http://org.eclipse.tycho.artifacts.De>pendencyResolutionException: Cannot resolve dependencies of MavenProject: edu.illinois.mobius:edu.illinois.mobius.product.core:1.0.0-SNAPSHOT @ /Users/kjkeefe/git/Mobius-4.6/releng/edu.illinois.mobius.pro<http://edu.illinois.mobius.pro>duct.core/pom.xml
at org.eclipse.tycho.p2.resolver.P2ResolverImpl.resolveDependencies(P2ResolverImpl.java:202)
at org.eclipse.tycho.p2.resolver.P2ResolverImpl.resolveDependencies(P2ResolverImpl.java:116)
at org.eclipse.tycho.p2.resolver.P2DependencyResolver.doResolveDependencies(P2DependencyResolver.java:367)
at org.eclipse.tycho.p2.resolver.P2DependencyResolver.resolveDependencies(P2DependencyResolver.java:335)
at org.eclipse.tycho.p2.facade.Re<http://org.eclipse.tycho.p2.facade.Re>positoryReferenceTool.addTargetPlatformRepository(RepositoryReferenceTool.java:124)
at org.eclipse.tycho.p2.facade.Re<http://org.eclipse.tycho.p2.facade.Re>positoryReferenceTool.getVisibleRepositories(RepositoryReferenceTool.java:96)
at org.eclipse.tycho.plugins.p2.repository.AssembleRepositoryMojo.getVisibleRepositories(AssembleRepositoryMojo.java:165)
at org.eclipse.tycho.plugins.p2.repository.AssembleRepositoryMojo.execute(AssembleRepositoryMojo.java:137)
at org.apache.maven.plugin.DefaultBuildPluginManager.executeMojo(DefaultBuildPluginManager.java:134)
... 21 more
Caused by: org.eclipse.tycho.p2.util.resolution.ResolverException: See log for details
at org.eclipse.tycho.p2.util.resolution.ProjectorResolutionStrategy.resolve(ProjectorResolutionStrategy.java:88)
at org.eclipse.tycho.p2.util.resolution.AbstractResolutionStrategy.resolve(AbstractResolutionStrategy.java:42)
at org.eclipse.tycho.p2.resolver.P2ResolverImpl.resolveDependencies(P2ResolverImpl.java:195)
... 29 more
[ERROR]
[ERROR]
[ERROR] For more information about the errors and possible solutions, please read the following articles:
[ERROR] [Help 1] http://cwiki.apache.org/confluence/display/MAVEN/PluginExecutionException<https://urldefense.proofpoint.com/v2/url?u=http-3A__cwiki.apache.org_confluence_display_MAVEN_PluginExecutionException&d=DQMF-g&c=8hUWFZcy2Z-Za5rBPlktOQ&r=cGMglYXcPR0IoSyYQ4AQ6bvD725xIPobF9W5B8eSXuA&m=sis435jfM7eIL7PsaunYcYuy437-8rSUbzt9GAWwPSg&s=EH1aDCtIwr0eRU6dwj6VWOuwp4BpShrOe8aRJd79XHw&e=>
[ERROR]
[ERROR] After correcting the problems, you can resume the build with the command
[ERROR] mvn <goals> -rf :edu.illinois.mobius.product.core



_______________________________________________

tycho-user mailing list

tycho-***@eclipse.org<mailto:tycho-***@eclipse.org>

To change your delivery options, retrieve your password, or unsubscribe from this list, visit

https://dev.eclipse.org/mailman/listinfo/tycho-user<https://urldefense.proofpoint.com/v2/url?u=https-3A__dev.eclipse.org_mailman_listinfo_tycho-2Duser&d=DQMF-g&c=8hUWFZcy2Z-Za5rBPlktOQ&r=cGMglYXcPR0IoSyYQ4AQ6bvD725xIPobF9W5B8eSXuA&m=sis435jfM7eIL7PsaunYcYuy437-8rSUbzt9GAWwPSg&s=GBw94hWU4AeGz-yzWQmF9V4c7-s_GFAOtgzpOvtW8K8&e=>
--
The people that bring you Usque<https://urldefense.proofpoint.com/v2/url?u=http-3A__Usque.software_&d=DQMF-g&c=8hUWFZcy2Z-Za5rBPlktOQ&r=cGMglYXcPR0IoSyYQ4AQ6bvD725xIPobF9W5B8eSXuA&m=sis435jfM7eIL7PsaunYcYuy437-8rSUbzt9GAWwPSg&s=DA0GFwDciDupaVdO4Wz43---Fm7JVKAUGTQE4v5NWUw&e=>.

_______________________________________________
tycho-user mailing list
tycho-***@eclipse.org<mailto:tycho-***@eclipse.org>
To change your delivery options, retrieve your password, or unsubscribe from this list, visit
https://dev.eclipse.org/mailman/listinfo/tycho-user<https://urldefense.proofpoint.com/v2/url?u=https-3A__dev.eclipse.org_mailman_listinfo_tycho-2Duser&d=DQMGaQ&c=8hUWFZcy2Z-Za5rBPlktOQ&r=cGMglYXcPR0IoSyYQ4AQ6bvD725xIPobF9W5B8eSXuA&m=pchSQ8yeIK-W_ODin3-D0TaiiDCAFiW67aADwp4RPo0&s=llnfZ30ieDrc3w8Rad79vcmZp5UoLOj8UR91JdAAmOw&e=>


_______________________________________________
tycho-user mailing list
tycho-***@eclipse.org<mailto:tycho-***@eclipse.org>
To change your delivery options, retrieve your password, or unsubscribe from this list, visit
https://dev.eclipse.org/mailman/listinfo/tycho-user
Ken Keefe
2016-10-06 22:00:28 UTC
Permalink
I am running mvn clean verify from the root of my project, so it goes
through and builds all of my bundles, then my features, and then tries to
build the update site. Is that a single reactor or are those each a
separate reactor?

To install them, is that something I add to my pom.xml or an argument I
need to give at the command line? If I install bundles and features during
one build, will those be wiped away for subsequent builds? What I mean is
if I build and install my bundles and features so maven can get them, then
make some code changes and rerun the build, will the new build rebuild the
bundle with the changed code and use it up the chain?

Thanks for your help!

Ken
Post by Tom Bryan (tombry)
I was probably unclear. Unless your edu.illinois.mobius:edu.illinois.mobius.update
project also builds everything, I don’t think that it will find its
dependencies unless they’re part of the target platform, available in your
project’s p2 update site repositories, or installed to your local maven
repository.
Therefore, I suspect that you’ll either need to build the plugins and
feature *and* create the update site as part of a *single* Maven reactor,
Or
You’ll need to use the “install” goal while building the plugins,
features, and products. That way, when you later run Maven on your update
project that builds the update site, it will find the plugins, features,
and other artifacts that you just built in the maven repository.
---Tom
Date: Thursday, October 6, 2016 at 5:42 PM
Subject: Re: [tycho-user] Trouble building an RCP product
mvn clean install gives me the same error.
[ERROR] Failed to execute goal org.eclipse.tycho:tycho-p2-
repository-plugin:0.25.0:assemble-repository
Execution default-assemble-repository of goal org.eclipse.tycho:tycho-p2-
repository-plugin:0.25.0:assemble-repository failed: Cannot resolve
dependencies of MavenProject: edu.illinois.mobius:edu.
releng/edu.illinois.mobius.update/pom.xml: See log for details -> [Help 1]
[ERROR]
[ERROR] To see the full stack trace of the errors, re-run Maven with the -e switch.
[ERROR] Re-run Maven using the -X switch to enable full debug logging.
[ERROR]
[ERROR] For more information about the errors and possible solutions,
[ERROR] [Help 1] http://cwiki.apache.org/confluence/display/MAVEN/
PluginExecutionException
<https://urldefense.proofpoint.com/v2/url?u=http-3A__cwiki.apache.org_confluence_display_MAVEN_PluginExecutionException&d=DQMGaQ&c=8hUWFZcy2Z-Za5rBPlktOQ&r=cGMglYXcPR0IoSyYQ4AQ6bvD725xIPobF9W5B8eSXuA&m=CByV2NHU2ryRFKYujLRWHjNGZqdOHF95rBonlIU85TM&s=xak1SdnOSMbs-50quGvJlGXXsAXCGrS4JSbEXv_Z5z8&e=>
[ERROR]
[ERROR] After correcting the problems, you can resume the build with the command
[ERROR] mvn <goals> -rf :edu.illinois.mobius.update
Ken
Post by Tom Bryan (tombry)
Did you try to do an install instead?
mvn clean install
---Tom
Date: Thursday, October 6, 2016 at 4:34 PM
Subject: Re: [tycho-user] Trouble building an RCP product
http://www.vogella.com/tutorials/EclipseTycho/article.html#run-the-build
<https://urldefense.proofpoint.com/v2/url?u=http-3A__www.vogella.com_tutorials_EclipseTycho_article.html-23run-2Dthe-2Dbuild&d=DQMGaQ&c=8hUWFZcy2Z-Za5rBPlktOQ&r=cGMglYXcPR0IoSyYQ4AQ6bvD725xIPobF9W5B8eSXuA&m=pchSQ8yeIK-W_ODin3-D0TaiiDCAFiW67aADwp4RPo0&s=f4dUoxTJzoltVu8G-ZrjWRXTxJmd7ep8gV_2AiVSeeg&e=>
I get the same sort of error saying it cannot resolve the dependencies. I
decided to change the category.xml file around to see if I could narrow
down the problem. I ended up removing all of my features and adding one of
the features in the build target (I randomly picked org.eclipse.cvs). This
builds correctly and I can see the new p2 repository with the cvs feature
and its plugins looking all correct.
When I remove that cvs feature and add just one of my features, it goes
back to the same error. Is there something I need to do to tell Maven where
to find my features? They are built just prior to it trying to create the
update site. I'm using the directory structure that vogella suggests, so my
recently constructed feature lives in features/edu.illinois.mobius.feature/target/
.
To initiate the maven build, I am using "mvn clean verify".
Thoughts?
Ken
[ERROR] Failed to execute goal org.eclipse.tycho:tycho-p2-rep
ository-plugin:0.25.0:assemble-repository (default-assemble-repository)
on project edu.illinois.mobius.update: Execution
default-assemble-repository of goal org.eclipse.tycho:tycho-p2-rep
ository-plugin:0.25.0:assemble-repository failed: Cannot resolve
dependencies of MavenProject: edu.illinois.mobius:edu.illino
releng/edu.illinois.mobius.update/pom.xml: See log for details -> [Help 1]
[ERROR]
[ERROR] To see the full stack trace of the errors, re-run Maven with the -e switch.
[ERROR] Re-run Maven using the -X switch to enable full debug logging.
[ERROR]
[ERROR] For more information about the errors and possible solutions,
[ERROR] [Help 1] http://cwiki.apache.org/conflu
ence/display/MAVEN/PluginExecutionException
<https://urldefense.proofpoint.com/v2/url?u=http-3A__cwiki.apache.org_confluence_display_MAVEN_PluginExecutionException&d=DQMGaQ&c=8hUWFZcy2Z-Za5rBPlktOQ&r=cGMglYXcPR0IoSyYQ4AQ6bvD725xIPobF9W5B8eSXuA&m=pchSQ8yeIK-W_ODin3-D0TaiiDCAFiW67aADwp4RPo0&s=yxjjr0MESlUXVGswDCbWO322NI1P2j_itGcBjl_hQ7U&e=>
[ERROR]
[ERROR] After correcting the problems, you can resume the build with the command
[ERROR] mvn <goals> -rf :edu.illinois.mobius.update
Post by Paul Roubekas
Here is mine that has been working for months.
<project xmlns="http://maven.apache.org/POM/4.0.0"
<https://urldefense.proofpoint.com/v2/url?u=http-3A__maven.apache.org_POM_4.0.0&d=DQMF-g&c=8hUWFZcy2Z-Za5rBPlktOQ&r=cGMglYXcPR0IoSyYQ4AQ6bvD725xIPobF9W5B8eSXuA&m=sis435jfM7eIL7PsaunYcYuy437-8rSUbzt9GAWwPSg&s=WwDOMXWIK-IYohDaP3089uFxsfnXWi7hhPh1rmJ62Ow&e=>
xmlns:xsi="http://www.w3.org/2001/XMLSchema-instance"
<https://urldefense.proofpoint.com/v2/url?u=http-3A__www.w3.org_2001_XMLSchema-2Dinstance&d=DQMF-g&c=8hUWFZcy2Z-Za5rBPlktOQ&r=cGMglYXcPR0IoSyYQ4AQ6bvD725xIPobF9W5B8eSXuA&m=sis435jfM7eIL7PsaunYcYuy437-8rSUbzt9GAWwPSg&s=XaWYV69YMr4riOBOXDjFSEFzayYgSalXvSA29hXhIMk&e=>
xsi:schemaLocation="http://maven.apache.org/POM/4.0.0
http://maven.apache.org/xsd/maven-4.0.0.xsd"
<https://urldefense.proofpoint.com/v2/url?u=http-3A__maven.apache.org_POM_4.0.0http-3A__maven.apache.org_xsd_maven-2D4.0.0.xsd&d=DQMF-g&c=8hUWFZcy2Z-Za5rBPlktOQ&r=cGMglYXcPR0IoSyYQ4AQ6bvD725xIPobF9W5B8eSXuA&m=sis435jfM7eIL7PsaunYcYuy437-8rSUbzt9GAWwPSg&s=PBaeHLYuyz9tT_Z2iPtAd6f423nUNCHXHGj0RUKJkTY&e=>
<modelVersion>4.0.0</modelVersion>
<name>MyProduct - application product</name>
<artifactId>com.myProduct.app.product</artifactId>
<packaging>eclipse-repository</packaging>
<parent>
<groupId>com.myProduct</groupId>
<artifactId>com.myProduct.releng.parent</artifactId>
<version>0.1.0-SNAPSHOT</version>
<relativePath>../../releng/com.myProduct.releng.parent/pom.x
ml</relativePath>
</parent>
<build>
<plugins>
<plugin>
<groupId>org.eclipse.tycho</groupId>
<artifactId>tycho-p2-director-plugin</artifactId>
<version>${tycho-version}</version>
<executions>
<execution>
<id>materialize-products</id>
<goals>
<goal>materialize-products</goal>
</goals>
</execution>
<execution>
<id>archive-products</id>
<goals>
<goal>archive-products</goal>
</goals>
</execution>
</executions>
</plugin>
</plugins>
</build
I wrote a few days ago about trouble building features and that is
working now. I'm on to the next task of trying to get my RCP product
constructed from those features. It looks like Maven is saying it can't
find the product. I don't understand how Maven/Tycho can put the project
name defined by the artifactId in the pom to the product definition file
(called core.project) file. I kept waiting for somewhere in the tutorial or
other tutorials for a place to identify the product definition file, but it
never came.
Any help in debugging this problem would be greatly appreciated. Here is
<project>
<modelVersion>4.0.0</modelVersion>
<parent>
<groupId>edu.illinois.mobius</groupId>
<artifactId>edu.illinois.mobius.releng</artifactId>
<version>1.0.0-SNAPSHOT</version>
</parent>
<groupId>edu.illinois.mobius</groupId>
<artifactId>edu.illinois.mobi
<https://urldefense.proofpoint.com/v2/url?u=http-3A__edu.illinois.mobi&d=DQMGaQ&c=8hUWFZcy2Z-Za5rBPlktOQ&r=cGMglYXcPR0IoSyYQ4AQ6bvD725xIPobF9W5B8eSXuA&m=CByV2NHU2ryRFKYujLRWHjNGZqdOHF95rBonlIU85TM&s=ELfm4CmIlttdpc_LlM2fUNm-UCkizaQpqwZrY3fobO8&e=>
us.product.core</artifactId>
<packaging>eclipse-repository</packaging>
<version>1.0.0-SNAPSHOT</version>
<build>
<plugins>
<plugin>
<groupId>org.eclipse.tycho</groupId>
<artifactId>tycho-p2-repository-plugin</artifactId>
<version>${tycho.version}</version>
<configuration>
<includeAllDependencies>true</includeAllDependencies>
</configuration>
</plugin>
<plugin>
<groupId>org.eclipse.tycho</groupId>
<artifactId>tycho-p2-director-plugin</artifactId>
<version>${tycho.version}</version>
<executions>
<execution>
<id>materialize-products</id>
<goals>
<goal>materialize-products</goal>
</goals>
</execution>
<execution>
<id>archive-products</id>
<goals>
<goal>archive-products</goal>
</goals>
</execution>
</executions>
</plugin>
</plugins>
</build>
</project>
[INFO] edu.illinois.mobius.product.co
<https://urldefense.proofpoint.com/v2/url?u=http-3A__edu.illinois.mobius.product.co&d=DQMGaQ&c=8hUWFZcy2Z-Za5rBPlktOQ&r=cGMglYXcPR0IoSyYQ4AQ6bvD725xIPobF9W5B8eSXuA&m=CByV2NHU2ryRFKYujLRWHjNGZqdOHF95rBonlIU85TM&s=LbsbBmG-FsYhwXOHIVGhpXGKDucxvfPpRSoFobImM1I&e=>re
................... FAILURE [ 0.262 s]
[INFO] ------------------------------------------------------------
------------
[INFO] BUILD FAILURE
[INFO] ------------------------------------------------------------
------------
[INFO] Total time: 38.834 s
[INFO] Finished at: 2016-10-06T13:21:59-05:00
[INFO] Final Memory: 286M/1288M
[INFO] ------------------------------------------------------------
------------
[ERROR] Failed to execute goal org.eclipse.tycho:tycho-p2-rep
ository-plugin:0.25.0:assemble-repository (default-assemble-repository)
on project edu.illinois.mobius.product.co
Execution default-assemble-repository of goal org.eclipse.tycho:tycho-p2-rep
ository-plugin:0.25.0:assemble-repository failed: Cannot resolve
dependencies of MavenProject: edu.illinois.mobius:edu.illino
releng/edu.illinois.mobius.pro
See log for details -> [Help 1]
org.apache.maven.lifecycle.LifecycleExecutionException: Failed to
execute goal org.eclipse.tycho:tycho-p2-rep
ository-plugin:0.25.0:assemble-repository (default-assemble-repository)
on project edu.illinois.mobius.product.co
Execution default-assemble-repository of goal org.eclipse.tycho:tycho-p2-rep
ository-plugin:0.25.0:assemble-repository failed: Cannot resolve
dependencies of MavenProject: edu.illinois.mobius:edu.illino
releng/edu.illinois.mobius.pro
<https://urldefense.proofpoint.com/v2/url?u=http-3A__edu.illinois.mobius.pro&d=DQMGaQ&c=8hUWFZcy2Z-Za5rBPlktOQ&r=cGMglYXcPR0IoSyYQ4AQ6bvD725xIPobF9W5B8eSXuA&m=CByV2NHU2ryRFKYujLRWHjNGZqdOHF95rBonlIU85TM&s=aP4Ku4YbUjGYHVVYdMb6XKEnLsopf2u7y2cpaveCWQ8&e=>
duct.core/pom.xml
at org.apache.maven.lifecycle.int
<https://urldefense.proofpoint.com/v2/url?u=http-3A__org.apache.maven.lifecycle.int&d=DQMGaQ&c=8hUWFZcy2Z-Za5rBPlktOQ&r=cGMglYXcPR0IoSyYQ4AQ6bvD725xIPobF9W5B8eSXuA&m=CByV2NHU2ryRFKYujLRWHjNGZqdOHF95rBonlIU85TM&s=21eGCqdUZ6eU0rQCZmjgDUJlrAjhDa_McEb7sV9LTUg&e=>
ernal.MojoExecutor.execute(MojoExecutor.java:224)
at org.apache.maven.lifecycle.int
<https://urldefense.proofpoint.com/v2/url?u=http-3A__org.apache.maven.lifecycle.int&d=DQMGaQ&c=8hUWFZcy2Z-Za5rBPlktOQ&r=cGMglYXcPR0IoSyYQ4AQ6bvD725xIPobF9W5B8eSXuA&m=CByV2NHU2ryRFKYujLRWHjNGZqdOHF95rBonlIU85TM&s=21eGCqdUZ6eU0rQCZmjgDUJlrAjhDa_McEb7sV9LTUg&e=>
ernal.MojoExecutor.execute(MojoExecutor.java:153)
at org.apache.maven.lifecycle.int
<https://urldefense.proofpoint.com/v2/url?u=http-3A__org.apache.maven.lifecycle.int&d=DQMGaQ&c=8hUWFZcy2Z-Za5rBPlktOQ&r=cGMglYXcPR0IoSyYQ4AQ6bvD725xIPobF9W5B8eSXuA&m=CByV2NHU2ryRFKYujLRWHjNGZqdOHF95rBonlIU85TM&s=21eGCqdUZ6eU0rQCZmjgDUJlrAjhDa_McEb7sV9LTUg&e=>
ernal.MojoExecutor.execute(MojoExecutor.java:145)
at org.apache.maven.lifecycle.int
<https://urldefense.proofpoint.com/v2/url?u=http-3A__org.apache.maven.lifecycle.int&d=DQMGaQ&c=8hUWFZcy2Z-Za5rBPlktOQ&r=cGMglYXcPR0IoSyYQ4AQ6bvD725xIPobF9W5B8eSXuA&m=CByV2NHU2ryRFKYujLRWHjNGZqdOHF95rBonlIU85TM&s=21eGCqdUZ6eU0rQCZmjgDUJlrAjhDa_McEb7sV9LTUg&e=>
ernal.LifecycleModuleBuilder.buildProject(LifecycleModuleBui
lder.java:116)
at org.apache.maven.lifecycle.int
<https://urldefense.proofpoint.com/v2/url?u=http-3A__org.apache.maven.lifecycle.int&d=DQMGaQ&c=8hUWFZcy2Z-Za5rBPlktOQ&r=cGMglYXcPR0IoSyYQ4AQ6bvD725xIPobF9W5B8eSXuA&m=CByV2NHU2ryRFKYujLRWHjNGZqdOHF95rBonlIU85TM&s=21eGCqdUZ6eU0rQCZmjgDUJlrAjhDa_McEb7sV9LTUg&e=>
ernal.LifecycleModuleBuilder.buildProject(LifecycleModuleBui
lder.java:80)
at org.apache.maven.lifecycle.int
<https://urldefense.proofpoint.com/v2/url?u=http-3A__org.apache.maven.lifecycle.int&d=DQMGaQ&c=8hUWFZcy2Z-Za5rBPlktOQ&r=cGMglYXcPR0IoSyYQ4AQ6bvD725xIPobF9W5B8eSXuA&m=CByV2NHU2ryRFKYujLRWHjNGZqdOHF95rBonlIU85TM&s=21eGCqdUZ6eU0rQCZmjgDUJlrAjhDa_McEb7sV9LTUg&e=>
ernal.builder.singlethreaded.SingleThreadedBuilder.build(Sin
gleThreadedBuilder.java:51)
at org.apache.maven.lifecycle.int
<https://urldefense.proofpoint.com/v2/url?u=http-3A__org.apache.maven.lifecycle.int&d=DQMGaQ&c=8hUWFZcy2Z-Za5rBPlktOQ&r=cGMglYXcPR0IoSyYQ4AQ6bvD725xIPobF9W5B8eSXuA&m=CByV2NHU2ryRFKYujLRWHjNGZqdOHF95rBonlIU85TM&s=21eGCqdUZ6eU0rQCZmjgDUJlrAjhDa_McEb7sV9LTUg&e=>
ernal.LifecycleStarter.execute(LifecycleStarter.java:128)
at org.apache.maven.DefaultMaven.doExecute(DefaultMaven.java:307)
at org.apache.maven.DefaultMaven.doExecute(DefaultMaven.java:193)
at org.apache.maven.DefaultMaven.execute(DefaultMaven.java:106)
at org.apache.maven.cli.MavenCli.execute(MavenCli.java:862)
at org.apache.maven.cli.MavenCli.doMain(MavenCli.java:286)
at org.apache.maven.cli.MavenCli.main(MavenCli.java:197)
at sun.reflect.NativeMethodAccessorImpl.invoke0(Native Method)
at sun.reflect.NativeMethodAccessorImpl.invoke(NativeMethodAcce
ssorImpl.java:62)
at sun.reflect.DelegatingMethodAccessorImpl.invoke(DelegatingMe
thodAccessorImpl.java:43)
at java.lang.reflect.Method.invoke(Method.java:497)
at org.codehaus.plexus.classworlds.launcher.Launcher.launchEnha
nced(Launcher.java:289)
at org.codehaus.plexus.classworlds.launcher.Launcher.launch(Lau
ncher.java:229)
at org.codehaus.plexus.classworlds.launcher.Launcher.mainWithEx
itCode(Launcher.java:415)
at org.codehaus.plexus.classworlds.launcher.Launcher.main(Launc
her.java:356)
Caused by: org.apache.maven.plugin.PluginExecutionException: Execution
default-assemble-repository of goal org.eclipse.tycho:tycho-p2-rep
ository-plugin:0.25.0:assemble-repository failed: Cannot resolve
dependencies of MavenProject: edu.illinois.mobius:edu.illino
releng/edu.illinois.mobius.pro
<https://urldefense.proofpoint.com/v2/url?u=http-3A__edu.illinois.mobius.pro&d=DQMGaQ&c=8hUWFZcy2Z-Za5rBPlktOQ&r=cGMglYXcPR0IoSyYQ4AQ6bvD725xIPobF9W5B8eSXuA&m=CByV2NHU2ryRFKYujLRWHjNGZqdOHF95rBonlIU85TM&s=aP4Ku4YbUjGYHVVYdMb6XKEnLsopf2u7y2cpaveCWQ8&e=>
duct.core/pom.xml
at org.apache.maven.plugin.DefaultBuildPluginManager.executeMoj
o(DefaultBuildPluginManager.java:145)
at org.apache.maven.lifecycle.int
<https://urldefense.proofpoint.com/v2/url?u=http-3A__org.apache.maven.lifecycle.int&d=DQMGaQ&c=8hUWFZcy2Z-Za5rBPlktOQ&r=cGMglYXcPR0IoSyYQ4AQ6bvD725xIPobF9W5B8eSXuA&m=CByV2NHU2ryRFKYujLRWHjNGZqdOHF95rBonlIU85TM&s=21eGCqdUZ6eU0rQCZmjgDUJlrAjhDa_McEb7sV9LTUg&e=>
ernal.MojoExecutor.execute(MojoExecutor.java:208)
... 20 more
Caused by: org.eclipse.tycho.artifacts.De
Cannot resolve dependencies of MavenProject: edu.illinois.mobius:edu.illino
releng/edu.illinois.mobius.pro
<https://urldefense.proofpoint.com/v2/url?u=http-3A__edu.illinois.mobius.pro&d=DQMGaQ&c=8hUWFZcy2Z-Za5rBPlktOQ&r=cGMglYXcPR0IoSyYQ4AQ6bvD725xIPobF9W5B8eSXuA&m=CByV2NHU2ryRFKYujLRWHjNGZqdOHF95rBonlIU85TM&s=aP4Ku4YbUjGYHVVYdMb6XKEnLsopf2u7y2cpaveCWQ8&e=>
duct.core/pom.xml
at org.eclipse.tycho.p2.resolver.P2ResolverImpl.resolveDependen
cies(P2ResolverImpl.java:202)
at org.eclipse.tycho.p2.resolver.P2ResolverImpl.resolveDependen
cies(P2ResolverImpl.java:116)
at org.eclipse.tycho.p2.resolver.P2DependencyResolver.doResolve
Dependencies(P2DependencyResolver.java:367)
at org.eclipse.tycho.p2.resolver.P2DependencyResolver.resolveDe
pendencies(P2DependencyResolver.java:335)
at org.eclipse.tycho.p2.facade.Re
<https://urldefense.proofpoint.com/v2/url?u=http-3A__org.eclipse.tycho.p2.facade.Re&d=DQMGaQ&c=8hUWFZcy2Z-Za5rBPlktOQ&r=cGMglYXcPR0IoSyYQ4AQ6bvD725xIPobF9W5B8eSXuA&m=CByV2NHU2ryRFKYujLRWHjNGZqdOHF95rBonlIU85TM&s=B4enVLF77YMeqsOgppBWJu6yKEsQwlKqCZO0I5cnVWQ&e=>
positoryReferenceTool.addTargetPlatformRepository(Repository
ReferenceTool.java:124)
at org.eclipse.tycho.p2.facade.Re
<https://urldefense.proofpoint.com/v2/url?u=http-3A__org.eclipse.tycho.p2.facade.Re&d=DQMGaQ&c=8hUWFZcy2Z-Za5rBPlktOQ&r=cGMglYXcPR0IoSyYQ4AQ6bvD725xIPobF9W5B8eSXuA&m=CByV2NHU2ryRFKYujLRWHjNGZqdOHF95rBonlIU85TM&s=B4enVLF77YMeqsOgppBWJu6yKEsQwlKqCZO0I5cnVWQ&e=>
positoryReferenceTool.getVisibleRepositories(RepositoryRefer
enceTool.java:96)
at org.eclipse.tycho.plugins.p2.repository.AssembleRepositoryMo
jo.getVisibleRepositories(AssembleRepositoryMojo.java:165)
at org.eclipse.tycho.plugins.p2.repository.AssembleRepositoryMo
jo.execute(AssembleRepositoryMojo.java:137)
at org.apache.maven.plugin.DefaultBuildPluginManager.executeMoj
o(DefaultBuildPluginManager.java:134)
... 21 more
Caused by: org.eclipse.tycho.p2.util.resolution.ResolverException: See log for details
at org.eclipse.tycho.p2.util.resolution.ProjectorResolutionStra
tegy.resolve(ProjectorResolutionStrategy.java:88)
at org.eclipse.tycho.p2.util.resolution.AbstractResolutionStrat
egy.resolve(AbstractResolutionStrategy.java:42)
at org.eclipse.tycho.p2.resolver.P2ResolverImpl.resolveDependen
cies(P2ResolverImpl.java:195)
... 29 more
[ERROR]
[ERROR]
[ERROR] For more information about the errors and possible solutions,
[ERROR] [Help 1] http://cwiki.apache.org/conflu
ence/display/MAVEN/PluginExecutionException
<https://urldefense.proofpoint.com/v2/url?u=http-3A__cwiki.apache.org_confluence_display_MAVEN_PluginExecutionException&d=DQMF-g&c=8hUWFZcy2Z-Za5rBPlktOQ&r=cGMglYXcPR0IoSyYQ4AQ6bvD725xIPobF9W5B8eSXuA&m=sis435jfM7eIL7PsaunYcYuy437-8rSUbzt9GAWwPSg&s=EH1aDCtIwr0eRU6dwj6VWOuwp4BpShrOe8aRJd79XHw&e=>
[ERROR]
[ERROR] After correcting the problems, you can resume the build with the command
[ERROR] mvn <goals> -rf :edu.illinois.mobius.product.core
_______________________________________________
tycho-user mailing list
To change your delivery options, retrieve your password, or unsubscribe from this list, visit
https://dev.eclipse.org/mailman/listinfo/tycho-user <https://urldefense.proofpoint.com/v2/url?u=https-3A__dev.eclipse.org_mailman_listinfo_tycho-2Duser&d=DQMF-g&c=8hUWFZcy2Z-Za5rBPlktOQ&r=cGMglYXcPR0IoSyYQ4AQ6bvD725xIPobF9W5B8eSXuA&m=sis435jfM7eIL7PsaunYcYuy437-8rSUbzt9GAWwPSg&s=GBw94hWU4AeGz-yzWQmF9V4c7-s_GFAOtgzpOvtW8K8&e=>
--
The people that bring you Usque
<https://urldefense.proofpoint.com/v2/url?u=http-3A__Usque.software_&d=DQMF-g&c=8hUWFZcy2Z-Za5rBPlktOQ&r=cGMglYXcPR0IoSyYQ4AQ6bvD725xIPobF9W5B8eSXuA&m=sis435jfM7eIL7PsaunYcYuy437-8rSUbzt9GAWwPSg&s=DA0GFwDciDupaVdO4Wz43---Fm7JVKAUGTQE4v5NWUw&e=>
.
_______________________________________________
tycho-user mailing list
To change your delivery options, retrieve your password, or unsubscribe
from this list, visit
https://dev.eclipse.org/mailman/listinfo/tycho-user
<https://urldefense.proofpoint.com/v2/url?u=https-3A__dev.eclipse.org_mailman_listinfo_tycho-2Duser&d=DQMGaQ&c=8hUWFZcy2Z-Za5rBPlktOQ&r=cGMglYXcPR0IoSyYQ4AQ6bvD725xIPobF9W5B8eSXuA&m=pchSQ8yeIK-W_ODin3-D0TaiiDCAFiW67aADwp4RPo0&s=llnfZ30ieDrc3w8Rad79vcmZp5UoLOj8UR91JdAAmOw&e=>
_______________________________________________
tycho-user mailing list
To change your delivery options, retrieve your password, or unsubscribe
from this list, visit
https://dev.eclipse.org/mailman/listinfo/tycho-user
<https://urldefense.proofpoint.com/v2/url?u=https-3A__dev.eclipse.org_mailman_listinfo_tycho-2Duser&d=DQMGaQ&c=8hUWFZcy2Z-Za5rBPlktOQ&r=cGMglYXcPR0IoSyYQ4AQ6bvD725xIPobF9W5B8eSXuA&m=CByV2NHU2ryRFKYujLRWHjNGZqdOHF95rBonlIU85TM&s=ld9E3SWoaLLPW13icZj0Tr_HrixOF0SwKW2Sa2c5g3k&e=>
_______________________________________________
tycho-user mailing list
To change your delivery options, retrieve your password, or unsubscribe
from this list, visit
https://dev.eclipse.org/mailman/listinfo/tycho-user
Tom Bryan (tombry)
2016-10-06 22:17:01 UTC
Permalink
Maybe I’m the wrong one to ask. I don’t actually build an update site for my product. We just use Tycho to build an RCP and then create installs for the materialized product. :) We’ve just had similar problems with finding dependencies when assembling our product when we used to build the product in multiple passes. Moving everything to be driven by a single “aggregate” pom.xml solved all of those problems.

I am not a Maven expert, but I think that you’re in a single reactor if you have a single Maven process that runs as a multi-module build from an aggregate pom.xml. See, for example, https://www.smartics.eu/confluence/display/BLOG/2013/07/22/Using+Aggregate+and+Parent+POMs.

Normally, I’d run mvn clean install. The verify goal stops one step short of install, but just switching from mvn verify to mvn install should be sufficient, I think. See also https://maven.apache.org/guides/introduction/introduction-to-the-lifecycle.html.

---Tom

From: <tycho-user-***@eclipse.org<mailto:tycho-user-***@eclipse.org>> on behalf of Ken Keefe <***@illinois.edu<mailto:***@illinois.edu>>
Reply-To: Tycho user list <tycho-***@eclipse.org<mailto:tycho-***@eclipse.org>>
Date: Thursday, October 6, 2016 at 6:00 PM
To: Tycho user list <tycho-***@eclipse.org<mailto:tycho-***@eclipse.org>>
Subject: Re: [tycho-user] Trouble building an RCP product

I am running mvn clean verify from the root of my project, so it goes through and builds all of my bundles, then my features, and then tries to build the update site. Is that a single reactor or are those each a separate reactor?

To install them, is that something I add to my pom.xml or an argument I need to give at the command line? If I install bundles and features during one build, will those be wiped away for subsequent builds? What I mean is if I build and install my bundles and features so maven can get them, then make some code changes and rerun the build, will the new build rebuild the bundle with the changed code and use it up the chain?

Thanks for your help!

Ken

On Thu, Oct 6, 2016 at 2:56 PM, Tom Bryan (tombry) <***@cisco.com<mailto:***@cisco.com>> wrote:
I was probably unclear. Unless your edu.illinois.mobius:edu.illinois.mobius.update project also builds everything, I don’t think that it will find its dependencies unless they’re part of the target platform, available in your project’s p2 update site repositories, or installed to your local maven repository.

Therefore, I suspect that you’ll either need to build the plugins and feature and create the update site as part of a single Maven reactor,
Or
You’ll need to use the “install” goal while building the plugins, features, and products. That way, when you later run Maven on your update project that builds the update site, it will find the plugins, features, and other artifacts that you just built in the maven repository.

---Tom

From: <tycho-user-***@eclipse.org<mailto:tycho-user-***@eclipse.org>> on behalf of Ken Keefe <***@illinois.edu<mailto:***@illinois.edu>>
Reply-To: Tycho user list <tycho-***@eclipse.org<mailto:tycho-***@eclipse.org>>
Date: Thursday, October 6, 2016 at 5:42 PM

To: Tycho user list <tycho-***@eclipse.org<mailto:tycho-***@eclipse.org>>
Subject: Re: [tycho-user] Trouble building an RCP product

mvn clean install gives me the same error.

[ERROR] Failed to execute goal org.eclipse.tycho:tycho-p2-repository-plugin:0.25.0:assemble-repository (default-assemble-repository) on project edu.illinois.mobius.update: Execution default-assemble-repository of goal org.eclipse.tycho:tycho-p2-repository-plugin:0.25.0:assemble-repository failed: Cannot resolve dependencies of MavenProject: edu.illinois.mobius:edu.illinois.mobius.update:2.6.0-SNAPSHOT @ /Users/kjkeefe/git/Mobius-4.6/releng/edu.illinois.mobius.update/pom.xml: See log for details -> [Help 1]
[ERROR]
[ERROR] To see the full stack trace of the errors, re-run Maven with the -e switch.
[ERROR] Re-run Maven using the -X switch to enable full debug logging.
[ERROR]
[ERROR] For more information about the errors and possible solutions, please read the following articles:
[ERROR] [Help 1] http://cwiki.apache.org/confluence/display/MAVEN/PluginExecutionException<https://urldefense.proofpoint.com/v2/url?u=http-3A__cwiki.apache.org_confluence_display_MAVEN_PluginExecutionException&d=DQMGaQ&c=8hUWFZcy2Z-Za5rBPlktOQ&r=cGMglYXcPR0IoSyYQ4AQ6bvD725xIPobF9W5B8eSXuA&m=CByV2NHU2ryRFKYujLRWHjNGZqdOHF95rBonlIU85TM&s=xak1SdnOSMbs-50quGvJlGXXsAXCGrS4JSbEXv_Z5z8&e=>
[ERROR]
[ERROR] After correcting the problems, you can resume the build with the command
[ERROR] mvn <goals> -rf :edu.illinois.mobius.update

Ken

On Thu, Oct 6, 2016 at 2:08 PM, Tom Bryan (tombry) <***@cisco.com<mailto:***@cisco.com>> wrote:
Did you try to do an install instead?
mvn clean install

---Tom

From: <tycho-user-***@eclipse.org<mailto:tycho-user-***@eclipse.org>> on behalf of Ken Keefe <***@illinois.edu<mailto:***@illinois.edu>>
Reply-To: Tycho user list <tycho-***@eclipse.org<mailto:tycho-***@eclipse.org>>
Date: Thursday, October 6, 2016 at 4:34 PM
To: Tycho user list <tycho-***@eclipse.org<mailto:tycho-***@eclipse.org>>
Subject: Re: [tycho-user] Trouble building an RCP product

I switched to trying update site part of the vogella tutorial: http://www.vogella.com/tutorials/EclipseTycho/article.html#run-the-build<https://urldefense.proofpoint.com/v2/url?u=http-3A__www.vogella.com_tutorials_EclipseTycho_article.html-23run-2Dthe-2Dbuild&d=DQMGaQ&c=8hUWFZcy2Z-Za5rBPlktOQ&r=cGMglYXcPR0IoSyYQ4AQ6bvD725xIPobF9W5B8eSXuA&m=pchSQ8yeIK-W_ODin3-D0TaiiDCAFiW67aADwp4RPo0&s=f4dUoxTJzoltVu8G-ZrjWRXTxJmd7ep8gV_2AiVSeeg&e=>

I get the same sort of error saying it cannot resolve the dependencies. I decided to change the category.xml file around to see if I could narrow down the problem. I ended up removing all of my features and adding one of the features in the build target (I randomly picked org.eclipse.cvs). This builds correctly and I can see the new p2 repository with the cvs feature and its plugins looking all correct.

When I remove that cvs feature and add just one of my features, it goes back to the same error. Is there something I need to do to tell Maven where to find my features? They are built just prior to it trying to create the update site. I'm using the directory structure that vogella suggests, so my recently constructed feature lives in features/edu.illinois.mobius.feature/target/ .

To initiate the maven build, I am using "mvn clean verify".

Thoughts?

Ken

[ERROR] Failed to execute goal org.eclipse.tycho:tycho-p2-repository-plugin:0.25.0:assemble-repository (default-assemble-repository) on project edu.illinois.mobius.update: Execution default-assemble-repository of goal org.eclipse.tycho:tycho-p2-repository-plugin:0.25.0:assemble-repository failed: Cannot resolve dependencies of MavenProject: edu.illinois.mobius:edu.illinois.mobius.update:2.6.0-SNAPSHOT @ /Users/kjkeefe/git/Mobius-4.6/releng/edu.illinois.mobius.update/pom.xml: See log for details -> [Help 1]
[ERROR]
[ERROR] To see the full stack trace of the errors, re-run Maven with the -e switch.
[ERROR] Re-run Maven using the -X switch to enable full debug logging.
[ERROR]
[ERROR] For more information about the errors and possible solutions, please read the following articles:
[ERROR] [Help 1] http://cwiki.apache.org/confluence/display/MAVEN/PluginExecutionException<https://urldefense.proofpoint.com/v2/url?u=http-3A__cwiki.apache.org_confluence_display_MAVEN_PluginExecutionException&d=DQMGaQ&c=8hUWFZcy2Z-Za5rBPlktOQ&r=cGMglYXcPR0IoSyYQ4AQ6bvD725xIPobF9W5B8eSXuA&m=pchSQ8yeIK-W_ODin3-D0TaiiDCAFiW67aADwp4RPo0&s=yxjjr0MESlUXVGswDCbWO322NI1P2j_itGcBjl_hQ7U&e=>
[ERROR]
[ERROR] After correcting the problems, you can resume the build with the command
[ERROR] mvn <goals> -rf :edu.illinois.mobius.update



On Thu, Oct 6, 2016 at 12:45 PM, Paul Roubekas <***@orthogroup.holdings<mailto:***@orthogroup.holdings>> wrote:
Here is mine that has been working for months.


<project xmlns="http://maven.apache.org/POM/4.0.0"<https://urldefense.proofpoint.com/v2/url?u=http-3A__maven.apache.org_POM_4.0.0&d=DQMF-g&c=8hUWFZcy2Z-Za5rBPlktOQ&r=cGMglYXcPR0IoSyYQ4AQ6bvD725xIPobF9W5B8eSXuA&m=sis435jfM7eIL7PsaunYcYuy437-8rSUbzt9GAWwPSg&s=WwDOMXWIK-IYohDaP3089uFxsfnXWi7hhPh1rmJ62Ow&e=> xmlns:xsi="http://www.w3.org/2001/XMLSchema-instance"<https://urldefense.proofpoint.com/v2/url?u=http-3A__www.w3.org_2001_XMLSchema-2Dinstance&d=DQMF-g&c=8hUWFZcy2Z-Za5rBPlktOQ&r=cGMglYXcPR0IoSyYQ4AQ6bvD725xIPobF9W5B8eSXuA&m=sis435jfM7eIL7PsaunYcYuy437-8rSUbzt9GAWwPSg&s=XaWYV69YMr4riOBOXDjFSEFzayYgSalXvSA29hXhIMk&e=>
xsi:schemaLocation="http://maven.apache.org/POM/4.0.0 http://maven.apache.org/xsd/maven-4.0.0.xsd"<https://urldefense.proofpoint.com/v2/url?u=http-3A__maven.apache.org_POM_4.0.0http-3A__maven.apache.org_xsd_maven-2D4.0.0.xsd&d=DQMF-g&c=8hUWFZcy2Z-Za5rBPlktOQ&r=cGMglYXcPR0IoSyYQ4AQ6bvD725xIPobF9W5B8eSXuA&m=sis435jfM7eIL7PsaunYcYuy437-8rSUbzt9GAWwPSg&s=PBaeHLYuyz9tT_Z2iPtAd6f423nUNCHXHGj0RUKJkTY&e=>>
<modelVersion>4.0.0</modelVersion>
<name>MyProduct - application product</name>
<artifactId>com.myProduct.app.product</artifactId>
<packaging>eclipse-repository</packaging>
<parent>
<groupId>com.myProduct</groupId>
<artifactId>com.myProduct.releng.parent</artifactId>
<version>0.1.0-SNAPSHOT</version>
<relativePath>../../releng/com.myProduct.releng.parent/pom.xml</relativePath>
</parent>

<build>
<plugins>
<plugin>
<groupId>org.eclipse.tycho</groupId>
<artifactId>tycho-p2-director-plugin</artifactId>
<version>${tycho-version}</version>
<executions>
<execution>
<id>materialize-products</id>
<goals>
<goal>materialize-products</goal>
</goals>
</execution>
<execution>
<id>archive-products</id>
<goals>
<goal>archive-products</goal>
</goals>
</execution>
</executions>
</plugin>
</plugins>
</build

On 10/6/2016 2:28 PM, Ken Keefe wrote:
I wrote a few days ago about trouble building features and that is working now. I'm on to the next task of trying to get my RCP product constructed from those features. It looks like Maven is saying it can't find the product. I don't understand how Maven/Tycho can put the project name defined by the artifactId in the pom to the product definition file (called core.project) file. I kept waiting for somewhere in the tutorial or other tutorials for a place to identify the product definition file, but it never came.

Any help in debugging this problem would be greatly appreciated. Here is the pom from the product project:

<project>
<modelVersion>4.0.0</modelVersion>
<parent>
<groupId>edu.illinois.mobius</groupId>
<artifactId>edu.illinois.mobius.releng</artifactId>
<version>1.0.0-SNAPSHOT</version>
</parent>

<groupId>edu.illinois.mobius</groupId>
<artifactId>edu.illinois.mobi<https://urldefense.proofpoint.com/v2/url?u=http-3A__edu.illinois.mobi&d=DQMGaQ&c=8hUWFZcy2Z-Za5rBPlktOQ&r=cGMglYXcPR0IoSyYQ4AQ6bvD725xIPobF9W5B8eSXuA&m=CByV2NHU2ryRFKYujLRWHjNGZqdOHF95rBonlIU85TM&s=ELfm4CmIlttdpc_LlM2fUNm-UCkizaQpqwZrY3fobO8&e=>us.product.core</artifactId>
<packaging>eclipse-repository</packaging>
<version>1.0.0-SNAPSHOT</version>

<build>
<plugins>
<plugin>
<groupId>org.eclipse.tycho</groupId>
<artifactId>tycho-p2-repository-plugin</artifactId>
<version>${tycho.version}</version>
<configuration>
<includeAllDependencies>true</includeAllDependencies>
</configuration>
</plugin>
<plugin>
<groupId>org.eclipse.tycho</groupId>
<artifactId>tycho-p2-director-plugin</artifactId>
<version>${tycho.version}</version>
<executions>
<execution>
<id>materialize-products</id>
<goals>
<goal>materialize-products</goal>
</goals>
</execution>
<execution>
<id>archive-products</id>
<goals>
<goal>archive-products</goal>
</goals>
</execution>
</executions>
</plugin>
</plugins>
</build>
</project>

Here is the error output from maven:

[INFO] edu.illinois.mobius.product.co<https://urldefense.proofpoint.com/v2/url?u=http-3A__edu.illinois.mobius.product.co&d=DQMGaQ&c=8hUWFZcy2Z-Za5rBPlktOQ&r=cGMglYXcPR0IoSyYQ4AQ6bvD725xIPobF9W5B8eSXuA&m=CByV2NHU2ryRFKYujLRWHjNGZqdOHF95rBonlIU85TM&s=LbsbBmG-FsYhwXOHIVGhpXGKDucxvfPpRSoFobImM1I&e=>re ................... FAILURE [ 0.262 s]
[INFO] ------------------------------------------------------------------------
[INFO] BUILD FAILURE
[INFO] ------------------------------------------------------------------------
[INFO] Total time: 38.834 s
[INFO] Finished at: 2016-10-06T13:21:59-05:00
[INFO] Final Memory: 286M/1288M
[INFO] ------------------------------------------------------------------------
[ERROR] Failed to execute goal org.eclipse.tycho:tycho-p2-repository-plugin:0.25.0:assemble-repository (default-assemble-repository) on project edu.illinois.mobius.product.co<https://urldefense.proofpoint.com/v2/url?u=http-3A__edu.illinois.mobius.product.co&d=DQMGaQ&c=8hUWFZcy2Z-Za5rBPlktOQ&r=cGMglYXcPR0IoSyYQ4AQ6bvD725xIPobF9W5B8eSXuA&m=CByV2NHU2ryRFKYujLRWHjNGZqdOHF95rBonlIU85TM&s=LbsbBmG-FsYhwXOHIVGhpXGKDucxvfPpRSoFobImM1I&e=>re: Execution default-assemble-repository of goal org.eclipse.tycho:tycho-p2-repository-plugin:0.25.0:assemble-repository failed: Cannot resolve dependencies of MavenProject: edu.illinois.mobius:edu.illinois.mobius.product.core:1.0.0-SNAPSHOT @ /Users/kjkeefe/git/Mobius-4.6/releng/edu.illinois.mobius.pro<https://urldefense.proofpoint.com/v2/url?u=http-3A__edu.illinois.mobius.pro&d=DQMGaQ&c=8hUWFZcy2Z-Za5rBPlktOQ&r=cGMglYXcPR0IoSyYQ4AQ6bvD725xIPobF9W5B8eSXuA&m=CByV2NHU2ryRFKYujLRWHjNGZqdOHF95rBonlIU85TM&s=aP4Ku4YbUjGYHVVYdMb6XKEnLsopf2u7y2cpaveCWQ8&e=>duct.core/pom.xml: See log for details -> [Help 1]
org.apache.maven.lifecycle.LifecycleExecutionException: Failed to execute goal org.eclipse.tycho:tycho-p2-repository-plugin:0.25.0:assemble-repository (default-assemble-repository) on project edu.illinois.mobius.product.co<https://urldefense.proofpoint.com/v2/url?u=http-3A__edu.illinois.mobius.product.co&d=DQMGaQ&c=8hUWFZcy2Z-Za5rBPlktOQ&r=cGMglYXcPR0IoSyYQ4AQ6bvD725xIPobF9W5B8eSXuA&m=CByV2NHU2ryRFKYujLRWHjNGZqdOHF95rBonlIU85TM&s=LbsbBmG-FsYhwXOHIVGhpXGKDucxvfPpRSoFobImM1I&e=>re: Execution default-assemble-repository of goal org.eclipse.tycho:tycho-p2-repository-plugin:0.25.0:assemble-repository failed: Cannot resolve dependencies of MavenProject: edu.illinois.mobius:edu.illinois.mobius.product.core:1.0.0-SNAPSHOT @ /Users/kjkeefe/git/Mobius-4.6/releng/edu.illinois.mobius.pro<https://urldefense.proofpoint.com/v2/url?u=http-3A__edu.illinois.mobius.pro&d=DQMGaQ&c=8hUWFZcy2Z-Za5rBPlktOQ&r=cGMglYXcPR0IoSyYQ4AQ6bvD725xIPobF9W5B8eSXuA&m=CByV2NHU2ryRFKYujLRWHjNGZqdOHF95rBonlIU85TM&s=aP4Ku4YbUjGYHVVYdMb6XKEnLsopf2u7y2cpaveCWQ8&e=>duct.core/pom.xml
at org.apache.maven.lifecycle.int<https://urldefense.proofpoint.com/v2/url?u=http-3A__org.apache.maven.lifecycle.int&d=DQMGaQ&c=8hUWFZcy2Z-Za5rBPlktOQ&r=cGMglYXcPR0IoSyYQ4AQ6bvD725xIPobF9W5B8eSXuA&m=CByV2NHU2ryRFKYujLRWHjNGZqdOHF95rBonlIU85TM&s=21eGCqdUZ6eU0rQCZmjgDUJlrAjhDa_McEb7sV9LTUg&e=>ernal.MojoExecutor.execute(MojoExecutor.java:224)
at org.apache.maven.lifecycle.int<https://urldefense.proofpoint.com/v2/url?u=http-3A__org.apache.maven.lifecycle.int&d=DQMGaQ&c=8hUWFZcy2Z-Za5rBPlktOQ&r=cGMglYXcPR0IoSyYQ4AQ6bvD725xIPobF9W5B8eSXuA&m=CByV2NHU2ryRFKYujLRWHjNGZqdOHF95rBonlIU85TM&s=21eGCqdUZ6eU0rQCZmjgDUJlrAjhDa_McEb7sV9LTUg&e=>ernal.MojoExecutor.execute(MojoExecutor.java:153)
at org.apache.maven.lifecycle.int<https://urldefense.proofpoint.com/v2/url?u=http-3A__org.apache.maven.lifecycle.int&d=DQMGaQ&c=8hUWFZcy2Z-Za5rBPlktOQ&r=cGMglYXcPR0IoSyYQ4AQ6bvD725xIPobF9W5B8eSXuA&m=CByV2NHU2ryRFKYujLRWHjNGZqdOHF95rBonlIU85TM&s=21eGCqdUZ6eU0rQCZmjgDUJlrAjhDa_McEb7sV9LTUg&e=>ernal.MojoExecutor.execute(MojoExecutor.java:145)
at org.apache.maven.lifecycle.int<https://urldefense.proofpoint.com/v2/url?u=http-3A__org.apache.maven.lifecycle.int&d=DQMGaQ&c=8hUWFZcy2Z-Za5rBPlktOQ&r=cGMglYXcPR0IoSyYQ4AQ6bvD725xIPobF9W5B8eSXuA&m=CByV2NHU2ryRFKYujLRWHjNGZqdOHF95rBonlIU85TM&s=21eGCqdUZ6eU0rQCZmjgDUJlrAjhDa_McEb7sV9LTUg&e=>ernal.LifecycleModuleBuilder.buildProject(LifecycleModuleBuilder.java:116)
at org.apache.maven.lifecycle.int<https://urldefense.proofpoint.com/v2/url?u=http-3A__org.apache.maven.lifecycle.int&d=DQMGaQ&c=8hUWFZcy2Z-Za5rBPlktOQ&r=cGMglYXcPR0IoSyYQ4AQ6bvD725xIPobF9W5B8eSXuA&m=CByV2NHU2ryRFKYujLRWHjNGZqdOHF95rBonlIU85TM&s=21eGCqdUZ6eU0rQCZmjgDUJlrAjhDa_McEb7sV9LTUg&e=>ernal.LifecycleModuleBuilder.buildProject(LifecycleModuleBuilder.java:80)
at org.apache.maven.lifecycle.int<https://urldefense.proofpoint.com/v2/url?u=http-3A__org.apache.maven.lifecycle.int&d=DQMGaQ&c=8hUWFZcy2Z-Za5rBPlktOQ&r=cGMglYXcPR0IoSyYQ4AQ6bvD725xIPobF9W5B8eSXuA&m=CByV2NHU2ryRFKYujLRWHjNGZqdOHF95rBonlIU85TM&s=21eGCqdUZ6eU0rQCZmjgDUJlrAjhDa_McEb7sV9LTUg&e=>ernal.builder.singlethreaded.SingleThreadedBuilder.build(SingleThreadedBuilder.java:51)
at org.apache.maven.lifecycle.int<https://urldefense.proofpoint.com/v2/url?u=http-3A__org.apache.maven.lifecycle.int&d=DQMGaQ&c=8hUWFZcy2Z-Za5rBPlktOQ&r=cGMglYXcPR0IoSyYQ4AQ6bvD725xIPobF9W5B8eSXuA&m=CByV2NHU2ryRFKYujLRWHjNGZqdOHF95rBonlIU85TM&s=21eGCqdUZ6eU0rQCZmjgDUJlrAjhDa_McEb7sV9LTUg&e=>ernal.LifecycleStarter.execute(LifecycleStarter.java:128)
at org.apache.maven.DefaultMaven.doExecute(DefaultMaven.java:307)
at org.apache.maven.DefaultMaven.doExecute(DefaultMaven.java:193)
at org.apache.maven.DefaultMaven.execute(DefaultMaven.java:106)
at org.apache.maven.cli.MavenCli.execute(MavenCli.java:862)
at org.apache.maven.cli.MavenCli.doMain(MavenCli.java:286)
at org.apache.maven.cli.MavenCli.main(MavenCli.java:197)
at sun.reflect.NativeMethodAccessorImpl.invoke0(Native Method)
at sun.reflect.NativeMethodAccessorImpl.invoke(NativeMethodAccessorImpl.java:62)
at sun.reflect.DelegatingMethodAccessorImpl.invoke(DelegatingMethodAccessorImpl.java:43)
at java.lang.reflect.Method.invoke(Method.java:497)
at org.codehaus.plexus.classworlds.launcher.Launcher.launchEnhanced(Launcher.java:289)
at org.codehaus.plexus.classworlds.launcher.Launcher.launch(Launcher.java:229)
at org.codehaus.plexus.classworlds.launcher.Launcher.mainWithExitCode(Launcher.java:415)
at org.codehaus.plexus.classworlds.launcher.Launcher.main(Launcher.java:356)
Caused by: org.apache.maven.plugin.PluginExecutionException: Execution default-assemble-repository of goal org.eclipse.tycho:tycho-p2-repository-plugin:0.25.0:assemble-repository failed: Cannot resolve dependencies of MavenProject: edu.illinois.mobius:edu.illinois.mobius.product.core:1.0.0-SNAPSHOT @ /Users/kjkeefe/git/Mobius-4.6/releng/edu.illinois.mobius.pro<https://urldefense.proofpoint.com/v2/url?u=http-3A__edu.illinois.mobius.pro&d=DQMGaQ&c=8hUWFZcy2Z-Za5rBPlktOQ&r=cGMglYXcPR0IoSyYQ4AQ6bvD725xIPobF9W5B8eSXuA&m=CByV2NHU2ryRFKYujLRWHjNGZqdOHF95rBonlIU85TM&s=aP4Ku4YbUjGYHVVYdMb6XKEnLsopf2u7y2cpaveCWQ8&e=>duct.core/pom.xml
at org.apache.maven.plugin.DefaultBuildPluginManager.executeMojo(DefaultBuildPluginManager.java:145)
at org.apache.maven.lifecycle.int<https://urldefense.proofpoint.com/v2/url?u=http-3A__org.apache.maven.lifecycle.int&d=DQMGaQ&c=8hUWFZcy2Z-Za5rBPlktOQ&r=cGMglYXcPR0IoSyYQ4AQ6bvD725xIPobF9W5B8eSXuA&m=CByV2NHU2ryRFKYujLRWHjNGZqdOHF95rBonlIU85TM&s=21eGCqdUZ6eU0rQCZmjgDUJlrAjhDa_McEb7sV9LTUg&e=>ernal.MojoExecutor.execute(MojoExecutor.java:208)
... 20 more
Caused by: org.eclipse.tycho.artifacts.De<https://urldefense.proofpoint.com/v2/url?u=http-3A__org.eclipse.tycho.artifacts.De&d=DQMGaQ&c=8hUWFZcy2Z-Za5rBPlktOQ&r=cGMglYXcPR0IoSyYQ4AQ6bvD725xIPobF9W5B8eSXuA&m=CByV2NHU2ryRFKYujLRWHjNGZqdOHF95rBonlIU85TM&s=sldhx4VN-kT-ZDj7JXIPZpRpuHEt9JJia0kQApfa4Rc&e=>pendencyResolutionException: Cannot resolve dependencies of MavenProject: edu.illinois.mobius:edu.illinois.mobius.product.core:1.0.0-SNAPSHOT @ /Users/kjkeefe/git/Mobius-4.6/releng/edu.illinois.mobius.pro<https://urldefense.proofpoint.com/v2/url?u=http-3A__edu.illinois.mobius.pro&d=DQMGaQ&c=8hUWFZcy2Z-Za5rBPlktOQ&r=cGMglYXcPR0IoSyYQ4AQ6bvD725xIPobF9W5B8eSXuA&m=CByV2NHU2ryRFKYujLRWHjNGZqdOHF95rBonlIU85TM&s=aP4Ku4YbUjGYHVVYdMb6XKEnLsopf2u7y2cpaveCWQ8&e=>duct.core/pom.xml
at org.eclipse.tycho.p2.resolver.P2ResolverImpl.resolveDependencies(P2ResolverImpl.java:202)
at org.eclipse.tycho.p2.resolver.P2ResolverImpl.resolveDependencies(P2ResolverImpl.java:116)
at org.eclipse.tycho.p2.resolver.P2DependencyResolver.doResolveDependencies(P2DependencyResolver.java:367)
at org.eclipse.tycho.p2.resolver.P2DependencyResolver.resolveDependencies(P2DependencyResolver.java:335)
at org.eclipse.tycho.p2.facade.Re<https://urldefense.proofpoint.com/v2/url?u=http-3A__org.eclipse.tycho.p2.facade.Re&d=DQMGaQ&c=8hUWFZcy2Z-Za5rBPlktOQ&r=cGMglYXcPR0IoSyYQ4AQ6bvD725xIPobF9W5B8eSXuA&m=CByV2NHU2ryRFKYujLRWHjNGZqdOHF95rBonlIU85TM&s=B4enVLF77YMeqsOgppBWJu6yKEsQwlKqCZO0I5cnVWQ&e=>positoryReferenceTool.addTargetPlatformRepository(RepositoryReferenceTool.java:124)
at org.eclipse.tycho.p2.facade.Re<https://urldefense.proofpoint.com/v2/url?u=http-3A__org.eclipse.tycho.p2.facade.Re&d=DQMGaQ&c=8hUWFZcy2Z-Za5rBPlktOQ&r=cGMglYXcPR0IoSyYQ4AQ6bvD725xIPobF9W5B8eSXuA&m=CByV2NHU2ryRFKYujLRWHjNGZqdOHF95rBonlIU85TM&s=B4enVLF77YMeqsOgppBWJu6yKEsQwlKqCZO0I5cnVWQ&e=>positoryReferenceTool.getVisibleRepositories(RepositoryReferenceTool.java:96)
at org.eclipse.tycho.plugins.p2.repository.AssembleRepositoryMojo.getVisibleRepositories(AssembleRepositoryMojo.java:165)
at org.eclipse.tycho.plugins.p2.repository.AssembleRepositoryMojo.execute(AssembleRepositoryMojo.java:137)
at org.apache.maven.plugin.DefaultBuildPluginManager.executeMojo(DefaultBuildPluginManager.java:134)
... 21 more
Caused by: org.eclipse.tycho.p2.util.resolution.ResolverException: See log for details
at org.eclipse.tycho.p2.util.resolution.ProjectorResolutionStrategy.resolve(ProjectorResolutionStrategy.java:88)
at org.eclipse.tycho.p2.util.resolution.AbstractResolutionStrategy.resolve(AbstractResolutionStrategy.java:42)
at org.eclipse.tycho.p2.resolver.P2ResolverImpl.resolveDependencies(P2ResolverImpl.java:195)
... 29 more
[ERROR]
[ERROR]
[ERROR] For more information about the errors and possible solutions, please read the following articles:
[ERROR] [Help 1] http://cwiki.apache.org/confluence/display/MAVEN/PluginExecutionException<https://urldefense.proofpoint.com/v2/url?u=http-3A__cwiki.apache.org_confluence_display_MAVEN_PluginExecutionException&d=DQMF-g&c=8hUWFZcy2Z-Za5rBPlktOQ&r=cGMglYXcPR0IoSyYQ4AQ6bvD725xIPobF9W5B8eSXuA&m=sis435jfM7eIL7PsaunYcYuy437-8rSUbzt9GAWwPSg&s=EH1aDCtIwr0eRU6dwj6VWOuwp4BpShrOe8aRJd79XHw&e=>
[ERROR]
[ERROR] After correcting the problems, you can resume the build with the command
[ERROR] mvn <goals> -rf :edu.illinois.mobius.product.core



_______________________________________________



tycho-user mailing list



tycho-***@eclipse.org<mailto:tycho-***@eclipse.org>



To change your delivery options, retrieve your password, or unsubscribe from this list, visit



https://dev.eclipse.org/mailman/listinfo/tycho-user<https://urldefense.proofpoint.com/v2/url?u=https-3A__dev.eclipse.org_mailman_listinfo_tycho-2Duser&d=DQMF-g&c=8hUWFZcy2Z-Za5rBPlktOQ&r=cGMglYXcPR0IoSyYQ4AQ6bvD725xIPobF9W5B8eSXuA&m=sis435jfM7eIL7PsaunYcYuy437-8rSUbzt9GAWwPSg&s=GBw94hWU4AeGz-yzWQmF9V4c7-s_GFAOtgzpOvtW8K8&e=>
--
The people that bring you Usque<https://urldefense.proofpoint.com/v2/url?u=http-3A__Usque.software_&d=DQMF-g&c=8hUWFZcy2Z-Za5rBPlktOQ&r=cGMglYXcPR0IoSyYQ4AQ6bvD725xIPobF9W5B8eSXuA&m=sis435jfM7eIL7PsaunYcYuy437-8rSUbzt9GAWwPSg&s=DA0GFwDciDupaVdO4Wz43---Fm7JVKAUGTQE4v5NWUw&e=>.

_______________________________________________
tycho-user mailing list
tycho-***@eclipse.org<mailto:tycho-***@eclipse.org>
To change your delivery options, retrieve your password, or unsubscribe from this list, visit
https://dev.eclipse.org/mailman/listinfo/tycho-user<https://urldefense.proofpoint.com/v2/url?u=https-3A__dev.eclipse.org_mailman_listinfo_tycho-2Duser&d=DQMGaQ&c=8hUWFZcy2Z-Za5rBPlktOQ&r=cGMglYXcPR0IoSyYQ4AQ6bvD725xIPobF9W5B8eSXuA&m=pchSQ8yeIK-W_ODin3-D0TaiiDCAFiW67aADwp4RPo0&s=llnfZ30ieDrc3w8Rad79vcmZp5UoLOj8UR91JdAAmOw&e=>


_______________________________________________
tycho-user mailing list
tycho-***@eclipse.org<mailto:tycho-***@eclipse.org>
To change your delivery options, retrieve your password, or unsubscribe from this list, visit
https://dev.eclipse.org/mailman/listinfo/tycho-user<https://urldefense.proofpoint.com/v2/url?u=https-3A__dev.eclipse.org_mailman_listinfo_tycho-2Duser&d=DQMGaQ&c=8hUWFZcy2Z-Za5rBPlktOQ&r=cGMglYXcPR0IoSyYQ4AQ6bvD725xIPobF9W5B8eSXuA&m=CByV2NHU2ryRFKYujLRWHjNGZqdOHF95rBonlIU85TM&s=ld9E3SWoaLLPW13icZj0Tr_HrixOF0SwKW2Sa2c5g3k&e=>


_______________________________________________
tycho-user mailing list
tycho-***@eclipse.org<mailto:tycho-***@eclipse.org>
To change your delivery options, retrieve your password, or unsubscribe from this list, visit
https://dev.eclipse.org/mailman/listinfo/tycho-user
Continue reading on narkive:
Loading...